{"text_format":"1","workbook":"xlsx","n_sheets":12,"sheets":["Startpagina","Waterinhoud installatie","ingave waterinhoud","Berekening waterinhoud","Keuze methode","Via µScm","Volgens Postcode","Materialen","Materialen (2)","Talen","Leveringsgebieden","Data"],"not_rendered":{"charts":0,"images":45,"macros":1,"external_links":0,"defined_names":3,"comments":0,"pivot_tables":0},"unopened":[],"bounds":{"document_bytes":16777216,"sheet_cells":100000,"rows_first":2000,"rows_last":500,"rows_between":2000,"halvings":0,"cell_chars":16384,"cell_head_chars":4096},"cells_cut":0,"cells_raw":0,"read":"whole","date_system":"1900"}

{"sheet":"Startpagina","index":0,"n_rows":2,"n_cols":2,"rows_kept":2,"cut":false,"hidden":false,"merged":[]}
[null,{"$f":"Talen!B3","v":"Capaciteitsberekening voor VES patronen"}]
[null,{"$f":"Talen!C3","v":"Calcul de la capacité des cartouches VES"}]

{"sheet":"Waterinhoud installatie","index":1,"n_rows":5,"n_cols":4,"rows_kept":5,"cut":false,"hidden":true,"merged":[]}
[{"$f":"Talen!A7","v":"Stap 1: Totale vermogen installatie "}]
[]
[{"$f":"Talen!A5","v":"Totaal vermogen installatie"},null,600,"kW"]
[]
[{"$f":"Talen!A6","v":"Waterinhoud gekend:"}]

{"sheet":"ingave waterinhoud","index":2,"n_rows":3,"n_cols":4,"rows_kept":3,"cut":false,"hidden":true,"merged":[]}
[{"$f":"Talen!A14","v":"Stap 2 : Ingave waterinhoud"}]
[]
[{"$f":"Talen!A13","v":"Geef de totale waterinhoud"},null,50,{"$f":"Talen!A12","v":"Liter"}]

{"sheet":"Berekening waterinhoud","index":3,"n_rows":40,"n_cols":9,"rows_kept":40,"cut":false,"hidden":true,"merged":[[16,0,16,4],[39,0,39,1],[7,5,7,6],[14,0,14,8],[0,0,0,7],[4,0,4,1],[5,0,5,1],[6,0,6,1],[7,0,7,1],[6,5,6,6],[9,5,9,8]]}
[{"$f":"Talen!A15","v":"Stap 2 : Berekening waterinhoud"}]
[]
[{"$f":"Talen!A19","v":"2.1 : Waterinhoud installatie berekenen:"}]
[]
[{"$f":"Talen!A20","v":"Waterinhoud ketel"},null,null,500,"L"]
[{"$f":"Talen!A21","v":"Inhoud buffervaten indien aanwezig"},null,null,null,"L"]
[{"$f":"Talen!A22","v":"Vermogen kringen  vloerverwarming"},null,null,"kW",null,{"$f":"Talen!A25","v":"Vermogen kringen sierradiatoren"},null,null,"kW"]
[{"$f":"Talen!A23","v":"vermogen kringen paneelradiatoren"},null,null,"kW",null,{"$f":"Talen!A26","v":"Vermogen kringen convectoren"},null,null,"kW"]
[]
[{"$f":"Talen!A24","v":"Waterinhoud installatie zonder leidingen"},null,null,{"$f":"IFERROR(D5+D6+(C7*18.5)+(C8*8.8)+(H7*12)+(H8*5.2),Talen!A27)","v":500},"L",{"$f":"IF(D10>0,\"\",Talen!A39)","v":""}]
[]
[]
[]
[]
[]
[{"$f":"Talen!A33","v":"Rekentool waterinhoud leidingen"}]
[{"$f":"Talen!A28","v":"Waterinhoud leidingen bepalen"}]
["DN",{"$f":"Talen!A29","v":"Duim"},{"$f":"Talen!A30","v":"l/m"},{"$f":"Talen!A31","v":"meter m"},{"$f":"Talen!A32","v":"Inhoud L"}]
[15,"1/2\"",0.2,null,{"$f":"C19*D19","v":0}]
[20,"3/4\"",0.37,null,0]
[25,"1\"",0.57999999999999996,null,0]
[32,"5/4\"",1.01,null,0]
[40,"6/4\"",1.37,null,0]
[50,"2\"",2.21,null,0]
[65,"2 1/2\"",3.9,null,0]
[80,"3\"",5.3,null,0]
[100,"4\"",9,null,0]
[125,"5\"",13.6,null,0]
[150,"6\"",20,null,0]
[200,"8\"",33.6,null,0]
[250,"10\"",53.2,null,0]
[300,"12\"",71.5,null,0]
[350,"14\"",90.5,null,0]
[400,"16\"",118,null,0]
["TOTAAL inhoud",null,null,null,{"$f":"SUM(E19:E34)","v":0}]
[]
[]
[{"$f":"Talen!A34","v":"Waterinhoud leidingen"},null,null,100,"L"]
[]
["totaal Volume",null,null,{"$f":"D38+D10","v":600},"L "]

{"sheet":"Keuze methode","index":4,"n_rows":1,"n_cols":1,"rows_kept":1,"cut":false,"hidden":true,"merged":[]}
[{"$f":"Talen!A40","v":"Stap 3 : kies uw berekingswijze"}]

{"sheet":"Via µScm","index":5,"n_rows":9,"n_cols":4,"rows_kept":9,"cut":false,"hidden":true,"merged":[[3,0,3,2],[4,0,4,2],[5,0,5,2],[6,0,6,2],[8,0,9,8]]}
[{"$f":"Talen!A43","v":"Stap 4 : Berekening via geleidbaarheid van het vulwater in µS/cm"}]
[]
[]
[{"$f":"Talen!A44","v":"Geleidbaarheid in µS/cm:"},null,null,500]
[{"$f":"Talen!A45","v":"Installatie-inhoud in L"},null,null,50]
[]
[{"$f":"Talen!A46","v":"Benodigde capaciteit"},null,null,{"$f":"D4*D5/30","v":833.33333333333337}]
[]
[{"$f":"IF(D4=\"\",\"\",IF('Waterinhoud installatie'!C3>599,Talen!A59,IF(D7<16001,Talen!A58,Talen!A59)))","v":"Waterbehandeling noodzakelijk"}]

{"sheet":"Volgens Postcode","index":6,"n_rows":15,"n_cols":6,"rows_kept":15,"cut":false,"hidden":true,"merged":[[14,0,15,8],[3,0,3,2],[9,0,9,2],[10,0,10,2],[11,0,11,2],[6,0,7,2]]}
[{"$f":"Talen!A54","v":"Stap 4 : Berekening via postnummer installatie-adres"}]
[]
[]
[{"$f":"Talen!A55","v":"Postnummer"},null,null,2800,null,{"$f":"VLOOKUP(D4,Leveringsgebieden!C2:E311,3,)","v":"Mechelen"}]
[]
[]
[{"$f":"Talen!A56","v":"Geleidbaarheid in µS/cm voor deze postnr:"}]
[null,null,null,{"$f":"VLOOKUP(D4,Leveringsgebieden!C2:D311,2,0)","v":570.27}]
[]
[{"$f":"Talen!A45","v":"Installatie-inhoud in L"},null,null,50]
[]
[{"$f":"Talen!A46","v":"Benodigde capaciteit"},null,null,{"$f":"D8*D10/30","v":950.45}]
[]
[]
[{"$f":"IF('Waterinhoud installatie'!C3>599,Talen!A59,IF(D12<16001,Talen!A58,Talen!A59))","v":"Waterbehandeling noodzakelijk"}]

{"sheet":"Materialen","index":7,"n_rows":24,"n_cols":8,"rows_kept":24,"cut":false,"hidden":true,"merged":[[22,3,22,5],[23,3,23,5],[11,0,11,2],[13,0,13,2],[12,0,12,2],[14,0,14,2],[19,3,19,5],[21,3,21,5]]}
[]
[]
[]
[]
[]
[]
[]
[]
[{"$f":"Talen!A62","v":"Stap 5 : Keuze van materiaal"}]
[]
[]
[{"$f":"Talen!A5","v":"Totaal vermogen installatie"},null,null,{"$f":"'Waterinhoud installatie'!C3","v":600},"kW"]
[{"$f":"Talen!A45","v":"Installatie-inhoud in L"},null,null,{"$f":"'ingave waterinhoud'!C3","v":50}]
[{"$f":"Talen!A44","v":"Geleidbaarheid in µS/cm:"},null,null,480.18]
[{"$f":"Talen!A46","v":"Benodigde capaciteit"},null,null,808303]
[]
[]
[]
[{"$f":"Talen!A47","v":"Benodigde Materialen:"}]
[null,null,{"$f":"Talen!A48","v":"Artikelnummer"},{"$f":"Talen!A49","v":"Omschrijving"},null,null,{"$f":"Talen!A50","v":"aantal"},{"$f":"Talen!A51","v":"prijs"}]
[]
[null,null,{"$f":"Data!A4","v":7738329421},{"$f":"Data!C4","v":"NFK2 vulinrichting"},null,null,1,{"$f":"G22*Data!E4","v":259}]
[null,null,{"$f":"IF(D15<16001,Data!A2,IF(D15<40001,Data!A2,IF(D15<1000000000,Data!A3)))","v":7738330146},{"$f":"VLOOKUP(C23,Data!$A$2:$E$42,2,)","v":"VES Kit P8000 Profi"},null,null,1,{"$f":"VLOOKUP(C23,Data!A2:E10,5,)","v":1040.29}]
[null,null,{"$f":"IF(D15<16001,Data!A11,IF(D15<40001,Data!A11,IF(D15<1000000000,Data!A5)))","v":7738330149},{"$f":"VLOOKUP(C24,Data!$A$2:$E$42,2,)","v":"Navulverpakking NF8000"},null,null,{"$f":"IF(IF(C23=Data!A2,ROUNDUP((((ROUNDUP((D15/72000*60)*1.05,0))-2)/2),0),ROUNDUP((ROUNDUP((D15/72000*60)*1.05,0)-14)/7,0))<0,0,IF(C23=Data!A2,ROUNDUP((((ROUNDUP((D15/72000*60)*1.05,0))-2)/2),0),ROUNDUP((ROUNDUP((D15/72000*60)*1.05,0)-14)/7,0)))","v":100},{"$f":"G24*(Data!E5)","v":14425}]

{"sheet":"Materialen (2)","index":8,"n_rows":29,"n_cols":9,"rows_kept":29,"cut":false,"hidden":true,"merged":[[27,3,27,5],[10,0,10,2],[21,3,21,5],[23,3,23,5],[28,3,28,5],[24,3,24,5],[25,3,25,5],[16,0,16,3],[17,0,17,3],[26,3,26,5]]}
[]
[]
[]
[]
[]
[]
[]
[]
[{"$f":"Talen!A62","v":"Stap 5 : Keuze van materiaal"}]
[]
[{"$f":"Talen!A5","v":"Totaal vermogen installatie"},null,null,null,{"$f":"'Waterinhoud installatie'!C3","v":600},"kW"]
[{"$f":"Talen!A45","v":"Installatie-inhoud in L"},null,null,null,{"$f":"'ingave waterinhoud'!C3","v":50},{"$f":"F17","v":"Liter"}]
[{"$f":"Talen!A44","v":"Geleidbaarheid in µS/cm:"},null,null,null,500]
[{"$f":"Talen!A46","v":"Benodigde capaciteit"},null,null,null,841666.66666666663]
[{"$f":"Talen!A66","v":"Debiet pomp bypassunit (th 1800):"},null,null,null,1250,{"$f":"Talen!A68","v":"Liter / uur"}]
[{"$f":"Talen!A67","v":"Tijd nodig om volume te behandelen:"},null,null,null,{"$f":"E12/E15","v":0.04},{"$f":"Talen!A69","v":"Uren"},{"$f":"Talen!A74","v":"of"},{"$f":"E16/24","v":1.6666666666666668E-3},{"$f":"Talen!A70","v":"Dagen"}]
[{"$f":"Talen!A71","v":"Aantal liter hars nodig (theoretisch berekend):"},null,null,null,{"$f":"E14/72000*60","v":701.38888888888891},{"$f":"Talen!A73","v":"Liter"}]
[{"$f":"Talen!A72","v":"Aantal liter hars nodig (met 5% reserve,naar boven afgerond):"},null,null,null,{"$f":"CEILING(E17*1.05,1)","v":737},{"$f":"F17","v":"Liter"}]
[]
[]
[{"$f":"Talen!A47","v":"Benodigde Materialen:"}]
[null,null,{"$f":"Talen!A48","v":"Artikelnummer"},{"$f":"Talen!A49","v":"Omschrijving"},null,null,{"$f":"Talen!A50","v":"aantal"},{"$f":"Talen!A51","v":"prijs"}]
[]
[null,null,{"$f":"Data!A4","v":7738329421},{"$f":"Data!C4","v":"NFK2 vulinrichting"},null,null,1,{"$f":"G24*Data!E4","v":259}]
[null,null,{"$f":"IF(E14<16001,Data!A2,IF(E14<40001,Data!A2,IF(E14<1000000000,Data!A3)))","v":7738330146},{"$f":"VLOOKUP(C25,Data!$A$2:$E$42,2,)","v":"VES Kit P8000 Profi"},null,null,1,{"$f":"VLOOKUP(C25,Data!A2:E10,5,)","v":1040.29}]
[null,null,{"$f":"Data!A10","v":7739453974},{"$f":"VLOOKUP(C26,Data!$A$2:$E$42,2,)","v":"Hars"},null,null,{"$f":"E18","v":737},{"$f":"G26*Data!E10","v":7591.1}]
[null,null,{"$f":"IF(I27=(ROUNDUP(E18/60,0)-1),Data!A6,Data!A7)","v":7739453971},{"$f":"VLOOKUP(C27,Data!$A$2:$E$42,2,)","v":"Water dienst ASA+1 wissel"},null,null,1,{"$f":"VLOOKUP(C27,Data!A2:E10,5,)","v":953}]
[null,null,{"$f":"Data!A8","v":7739453972},{"$f":"VLOOKUP(C28,Data!$A$2:$E$42,2,)","v":"Water controle+harswissel"},null,null,{"$f":"IF((ROUNDUP(G26/60,0)-2)<0,0,ROUNDUP(G26/60,0)-2)","v":11},{"$f":"G28*(Data!E7)","v":10483}]
[null,null,{"$f":"Data!A9","v":7739453973},{"$f":"VLOOKUP(C29,Data!$A$2:$E$42,2,)","v":"Water waarborg bypassunit"},null,null,1,{"$f":"G29*(Data!E8)","v":183}]

{"sheet":"Talen","index":9,"n_rows":75,"n_cols":3,"rows_kept":75,"cut":false,"hidden":true,"merged":[]}
[1,"1: Nederlands | 2: Frans"]
["Keuze taal","NL","FR"]
[{"$f":"IF($A$1=1,B3,C3)","v":"Capaciteitsberekening voor VES patronen"},"Capaciteitsberekening voor VES patronen","Calcul de la capacité des cartouches VES"]
[{"$f":"IF($A$1=1,B4,C4)","v":"Start"},"Start","Démarrer"]
["Totaal vermogen installatie","Totaal vermogen installatie","Puissance totale de l'installation"]
["Waterinhoud gekend:","Waterinhoud gekend:","Volume d'eau connu :"]
["Stap 1: Totale vermogen installatie ","Stap 1: Totale vermogen installatie ","Étape 1 : Puissance totale de l'installation"]
["Ja","Ja","Oui"]
["Nee","Nee","Non"]
["Verder","Verder","Suivant"]
["Terug","Terug","Retour"]
["Liter","Liter","Litres"]
["Geef de totale waterinhoud","Geef de totale waterinhoud","Entrer le volume d'eau total"]
["Stap 2 : Ingave waterinhoud","Stap 2 : Ingave waterinhoud","Étape 2 : Saisie du volume d'eau"]
["Stap 2 : Berekening waterinhoud","Stap 2 : Berekening waterinhoud","Étape 2 : Calcul du volume d'eau"]
["Waterinhoud leidingen gekend","Waterinhoud leidingen gekend","Volume d'eau conduites connu"]
["Bepalen via de rekentool","Bepalen via de rekentool","Déterminer via l'outil de calcul"]
["20% toeslag nemen op installatie?","20% toeslag nemen op installatie?","Ajouter 20% de plus à l'installation ?"]
["2.1 : Waterinhoud installatie berekenen:","2.1 : Waterinhoud installatie berekenen:","2.1 : Calcul du volume d'eau de l'installation :"]
["Waterinhoud ketel","Waterinhoud ketel","Volume d'eau de la chaudière"]
["Inhoud buffervaten indien aanwezig","Inhoud buffervaten indien aanwezig","Volume des réservoirs tampons, si présent"]
["Vermogen kringen  vloerverwarming","Vermogen kringen  vloerverwarming","Puissance des circuits de chauffage au sol"]
["vermogen kringen paneelradiatoren","vermogen kringen paneelradiatoren","Puissance des circuits des radiateurs à panneaux"]
["Waterinhoud installatie zonder leidingen","Waterinhoud installatie zonder leidingen","Volume d'eau de l'installation, hors conduites"]
["Vermogen kringen sierradiatoren","Vermogen kringen sierradiatoren","Puissance des circuits de radiateurs décoratifs"]
["Vermogen kringen convectoren","Vermogen kringen convectoren","Puissance des circuits de convecteurs"]
["Foute invoer","Foute invoer","Donnée incorrecte"]
["Waterinhoud leidingen bepalen","Waterinhoud leidingen bepalen","Déterminer le volume d'eau des conduites"]
["Duim","Duim","Pouce(s)"]
["l/m","l/m","l/m"]
["meter m","meter m","Mètre m"]
["Inhoud L","Inhoud L","Volume L"]
["Rekentool waterinhoud leidingen","Rekentool waterinhoud leidingen","Outil de calcul du volume d'eau des conduites"]
["Waterinhoud leidingen","Waterinhoud leidingen","Volume d'eau des conduites"]
["Kies één van de drie bovenstaande methodes om leidinginhoud te bepalen","Kies één van de drie bovenstaande methodes om leidinginhoud te bepalen","Sélectionner une des trois méthodes ci-dessus pour déterminer le volume des conduites"]
["Nederlands","Nederlands","Nederlands"]
["Français","Français","Français"]
["2.2 : Waterinhoud leidingen berekenen:","2.2 : Waterinhoud leidingen berekenen:","2.2 : Calcul du volume d'eau des conduites"]
["Gelieve minstens 1 waarde in te geven","Gelieve minstens 1 waarde in te geven","Veuillez entrer au moins 1 valeur"]
["Stap 3 : kies uw berekingswijze","Stap 3 : kies uw berekingswijze","Étape 3 : Choisir votre méthode de calcul"]
["Berekenen via schatting op basis van postnummer","Berekenen via schatting op basis van postnummer","Calcul via une estimation basée sur le code postal"]
["Berekenen via gekende geleidbaarheid van het vulwater in µS/cm","Berekenen via gekende geleidbaarheid van het vulwater in µS/cm","Calcul via la conductivité connue de l'eau de remplissage en µS/cm"]
["Stap 4 : Berekening via geleidbaarheid van het vulwater in µS/cm","Stap 4 : Berekening via geleidbaarheid van het vulwater in µS/cm","Étape 4 : Calcul via la conductivité de l'eau de remplissage en µS/cm"]
["Geleidbaarheid in µS/cm:","Geleidbaarheid in µS/cm:","Conductivité en µS/cm :"]
["Installatie-inhoud in L","Installatie-inhoud in L","Volume de l'installation en L"]
["Benodigde capaciteit","Benodigde capaciteit","Capacité requise"]
["Benodigde Materialen:","Benodigde Materialen:","Matériaux requis :"]
["Artikelnummer","Artikelnummer","Numéro d'article"]
["Omschrijving","Omschrijving","Description"]
["aantal","aantal","Nombre"]
["prijs","prijs","Prix"]
["Opnieuw beginnen","Opnieuw beginnen","Recommencer"]
["Afsluiten","Afsluiten","Terminer"]
["Stap 4 : Berekening via postnummer installatie-adres","Stap 4 : Berekening via postnummer installatie-adres","Étape 4 : Calcul via le code postal de l'adresse d'installation"]
["Postnummer","Postnummer","Code postal"]
["Geleidbaarheid in µS/cm voor deze postnr:","Geleidbaarheid in µS/cm voor deze postnr:","Conductivité en µS/cm pour ce code postal :"]
["<= Vul hier uw postcode in","<= Vul hier uw postcode in","<= Entrer votre code postal ici"]
["Geen waterbehandeling noodzakelijk","Geen waterbehandeling noodzakelijk","Pas de traitement de l’eau nécessaire"]
["Waterbehandeling noodzakelijk","Waterbehandeling noodzakelijk","Traitement de l’eau nécessaire"]
["Selectie van materialen","Selectie van materialen","Sélection du matériel"]
["Selectie van materialen en diensten","Selectie van materialen en diensten","Sélection du matériel et service"]
["Stap 5 : Keuze van materiaal","Stap 5 : Keuze van materiaal","Étape 5 : sélection du matériel"]
["Stap 5 : Keuze van materiaal en diensten","Stap 5 : Keuze van materiaal en diensten","Étape 5 : sélection du matériel et service"]
["Functie momenteel nog niet beschikbaar","Functie momenteel nog niet beschikbaar","Fonction momentanément indisponible"]
["Installatie-inhoud in L","Installatie-inhoud in L","Contenu de l’installation en L"]
["Debiet pomp bypassunit (th 1800):","Debiet pomp bypassunit (th 1800):","Débit de la pompe de l’unité by-pass (th 1800) "]
["Tijd nodig om volume te behandelen:","Tijd nodig om volume te behandelen:","Temps nécessaire pour le traitement du volume :"]
["Liter / uur","Liter / uur","Litre/heure"]
[{"$f":"IF($A$1=1,B69,C69)","v":"Uren"},"Uren","Heures"]
["Dagen","Dagen","Jours"]
["Aantal liter hars nodig (theoretisch berekend):","Aantal liter hars nodig (theoretisch berekend):","Nombre de litres de résine nécessaires (calcul théorique) :"]
["Aantal liter hars nodig (met 5% reserve,naar boven afgerond):","Aantal liter hars nodig (met 5% reserve,naar boven afgerond):","Nombre de litres de résine nécessaires (avec 5 % de réserve, arrondi au chiffre supérieur) :"]
["Liter","Liter","Litre"]
["of","of","ou"]
["Benodigde materialen voor waterkwaliteit","Benodigde materialen voor waterkwaliteit","Matériel nécessaire pour la qualité de l’eau"]

{"sheet":"Leveringsgebieden","index":10,"n_rows":320,"n_cols":12,"rows_kept":320,"cut":false,"hidden":true,"merged":[]}
["Gemeente","Leveringsgebied(en)",null,null,null,"positie /","Lengte","LEV1","LEV2","COND1","COND2"]
["Oudergem","DW B7/ DW B16",1160,797,{"$f":"A2","v":"Oudergem"},{"$f":"SEARCH(\"/\",B2)","v":6},{"$f":"LEN(B2)","v":13},"DW B7","DW B16",797,706,{"$f":"IFERROR(IF(J2<K2,K2,J2),\"\")","v":797}]
["Herne","DW B1",1540,756,{"$f":"A3","v":"Herne"}]
["Bever","DW B1",1547,756,"Bever"]
["Hoeilaart","DW B17",1560,745,"Hoeilaart"]
["Galmaarden","DW B2",1570,772,"Galmaarden"]
["Sint-Pieters-Leeuw","IWVB-BFI41/IWVB-BFI43",1600,704.1,"Sint-Pieters-Leeuw",{"$f":"SEARCH(\"/\",B7)","v":11},{"$f":"LEN(B7)","v":21},"Vivaqua-BFI41","IWVB-BFI43",704.1,620.29999999999995]
["Drogenbos","IWVB-BFI43",1620,620.29999999999995,"Drogenbos"]
["Linkebeek","Vivaqua-R50",1630,527.5,"Linkebeek",{"$f":"SEARCH(\"/\",B9)","v":{"$error":"#VALUE!"}},{"$f":"LEN(B9)","v":11},{"$f":"LEFT(B9,F9-1)","v":{"$error":"#VALUE!"}},{"$f":"MID(B9,F9+1,G9-F9)","v":{"$error":"#VALUE!"}},{"$error":"#VALUE!"},{"$error":"#VALUE!"}]
["Sint-Genesius-Rode","IWVB-B80/IWVB-R50",1640,704.1,"Sint-Genesius-Rode",{"$f":"SEARCH(\"/\",B10)","v":9},{"$f":"LEN(B10)","v":17},"IWVB-B80","IWVB-R50",638.29999999999995,704.1,{"$f":"IFERROR(IF(J10<K10,K10,J10),\"\")","v":704.1}]
["Beersel","TMVW LG 6",1650,784,"Beersel"]
["Pepingen","DW B1/DW B2",1670,772,"Pepingen",{"$f":"SEARCH(\"/\",B12)","v":6},{"$f":"LEN(B12)","v":11},{"$f":"LEFT(B12,F12-1)","v":"DW B1"},{"$f":"MID(B12,F12+1,G12-F12)","v":"DW B2"},756,772]
["Dilbeek","IWVB-BFI43/IWVB-R50",1700,704.1,"Dilbeek",{"$f":"SEARCH(\"/\",B13)","v":11},{"$f":"LEN(B13)","v":19},"IWVB-BFI43","IWVB-R50",620.29999999999995,704.1,{"$f":"IFERROR(IF(J13<K13,K13,J13),\"\")","v":704.1}]
["Asse","TMVW LG 2",1730,785,"Asse"]
["Ternat","DW B2/TMVW LG 2",1740,785,"Ternat",{"$f":"SEARCH(\"/\",B15)","v":6},{"$f":"LEN(B15)","v":15},{"$f":"LEFT(B15,F15-1)","v":"DW B2"},{"$f":"MID(B15,F15+1,G15-F15)","v":"TMVW LG 2"},772,785]
["Opwijk","DW B3/TMVW LG 2",1745,785,"Opwijk",{"$f":"SEARCH(\"/\",B16)","v":6},{"$f":"LEN(B16)","v":15},{"$f":"LEFT(B16,F16-1)","v":"DW B3"},{"$f":"MID(B16,F16+1,G16-F16)","v":"TMVW LG 2"},716,785]
["Lennik","DW B2",1750,772,"Lennik"]
["Gooik","DW B2",1755,772,"Gooik"]
["Roosdaal","DW B2",1760,772,"Roosdaal"]
["Liedekerke","TMVW LG 2",1770,785,"Liedekerke"]
["Wemmel","IWVB-R50",1780,527.5,"Wemmel",{"$f":"SEARCH(\"/\",B21)","v":{"$error":"#VALUE!"}},{"$f":"LEN(B21)","v":8},{"$error":"#VALUE!"},{"$error":"#VALUE!"},{"$error":"#VALUE!"},{"$error":"#VALUE!"}]
["Merchtem","DW B3",1785,716,"Merchtem"]
["Affligem","TMVW LG 2",1790,785,"Affligem"]
["Vilvoorde","DW B3/DW B5",1800,716,"Vilvoorde",{"$f":"SEARCH(\"/\",B24)","v":6},{"$f":"LEN(B24)","v":11},{"$f":"LEFT(B24,F24-1)","v":"DW B3"},{"$f":"MID(B24,F24+1,G24-F24)","v":"DW B5"},716,705.66666666666663]
["Steenokkerzeel","DW B5/Vivaqua-R50",1820,705.66666666666663,"Steenokkerzeel",{"$f":"SEARCH(\"/\",B25)","v":6},{"$f":"LEN(B25)","v":17},{"$f":"LEFT(B25,F25-1)","v":"DW B5"},{"$f":"MID(B25,F25+1,G25-F25)","v":"Vivaqua-R50"},705.66666666666663,527.5]
["Londerzeel","DW B3",1840,716,"Londerzeel"]
["Grimbergen","DW B3/IWVB-BFI41",1850,716,"Grimbergen",{"$f":"SEARCH(\"/\",B27)","v":6},{"$f":"LEN(B27)","v":16},"DW B3","Vivaqua-BFI41",716,704.1]
["Meise","DW B3",1860,716,"Meise"]
["Kampenhout","DW B5",1910,705.66666666666663,"Kampenhout"]
["Zaventem","DW B5/IWVB-BFI41",1930,705.66666666666663,"Zaventem",{"$f":"SEARCH(\"/\",B30)","v":6},{"$f":"LEN(B30)","v":16},"DW B5","Vivaqua-BFI41",705.66666666666663,704.1]
["Kraainem","Vivaqua-BFI41",1950,704.1,"Kraainem",{"$f":"SEARCH(\"/\",B31)","v":{"$error":"#VALUE!"}},{"$f":"LEN(B31)","v":13},{"$f":"LEFT(B31,F31-1)","v":{"$error":"#VALUE!"}},{"$f":"MID(B31,F31+1,G31-F31)","v":{"$error":"#VALUE!"}},{"$error":"#VALUE!"},{"$error":"#VALUE!"}]
["Zemst","DW B3/DW B5/DW B15",1980,716,"Zemst",{"$f":"SEARCH(\"/\",B32)","v":6},{"$f":"LEN(B32)","v":18},"DW B3","DW B15",716,446.85]
["Berendrecht","AWW-PB",2040,573,"Berendrecht"]
["Zandvliet","AWW-PB",2040,573,"Zandvliet"]
["Antwerpen","AWW-PST",2060,747,"Antwerpen"]
["Zwijndrecht","AWW-PST",2070,747,"Zwijndrecht"]
["Wijnegem","Pidpa 10",2110,587.39,"Wijnegem"]
["Borsbeek","Pidpa 10",2150,587.39,"Borsbeek"]
["Wommelgem","Pidpa 10",2160,587.39,"Wommelgem"]
["Herentals","Pidpa 4",2200,401.8,"Herentals"]
["Heist-op-den-Berg","Pidpa 11",2220,458.56,"Heist-op-den-Berg"]
["Herselt","Pidpa 11",2230,458.56,"Herselt"]
["Hulshout","Pidpa 11",2235,458.56,"Hulshout"]
["Zandhoven ","Pidpa 4/Pidpa 13",2240,451.35,"Zandhoven ",{"$f":"SEARCH(\"/\",B44)","v":8},{"$f":"LEN(B44)","v":16},{"$f":"LEFT(B44,F44-1)","v":"Pidpa 4"},{"$f":"MID(B44,F44+1,G44-F44)","v":"Pidpa 13"},401.8,451.35]
["Olen","Pidpa 4",2250,401.8,"Olen"]
["Westerlo","Pidpa 11",2260,458.56,"Westerlo"]
["Herenthout","Pidpa 4",2270,401.8,"Herenthout"]
["Lille","Pidpa 4/Pidpa 5/Pidpa 8",2275,446.85,"Lille",{"$f":"SEARCH(\"/\",B48)","v":8},{"$f":"LEN(B48)","v":23},"Pidpa 4","Pidpa 8",401.8,446.85,{"$f":"IFERROR(IF(J48<K48,K48,J48),\"\")","v":446.85}]
["Grobbendonk","Pidpa 4/Pidpa 13",2280,451.35,"Grobbendonk",{"$f":"SEARCH(\"/\",B49)","v":8},{"$f":"LEN(B49)","v":16},{"$f":"LEFT(B49,F49-1)","v":"Pidpa 4"},{"$f":"MID(B49,F49+1,G49-F49)","v":"Pidpa 13"},401.8,451.35]
["Vorselaar","Pidpa 4",2290,401.8,"Vorselaar"]
["Turnhout","Pidpa 9",2300,338.74,"Turnhout"]
["Rijkevorsel","Pidpa 5",2310,403.6,"Rijkevorsel"]
["Hoogstraten","Pidpa 5",2320,403.6,"Hoogstraten"]
["Merksplas","Pidpa 8",2330,446.85,"Merksplas"]
["Beerse","Pidpa 5/Pidpa 8",2340,446.85,"Beerse",{"$f":"SEARCH(\"/\",B55)","v":8},{"$f":"LEN(B55)","v":15},{"$f":"LEFT(B55,F55-1)","v":"Pidpa 5"},{"$f":"MID(B55,F55+1,G55-F55)","v":"Pidpa 8"},403.6,446.85]
["Vosselaar","Pidpa 8",2350,446.85,"Vosselaar"]
["Arendonk","Pidpa 9",2370,338.74,"Arendonk"]
["Ravels","Pidpa 9",2380,338.74,"Ravels"]
["Baarle-Hertog","Pidpa 8",2387,446.85,"Baarle-Hertog"]
["Malle","Pidpa 5",2390,403.6,"Malle"]
["Mol","Pidpa 7/Pidpa 9",2400,338.74,"Mol",{"$f":"SEARCH(\"/\",B61)","v":8},{"$f":"LEN(B61)","v":15},{"$f":"LEFT(B61,F61-1)","v":"Pidpa 7"},{"$f":"MID(B61,F61+1,G61-F61)","v":"Pidpa 9"},312.61,338.74]
["Laakdal","Pidpa 11",2430,458.56,"Laakdal"]
["Geel","Pidpa 1/Pidpa 4/Pidpa 7/Pidpa 9/Pidpa 11",2440,458.56,"Geel",{"$f":"SEARCH(\"/\",B63)","v":8},{"$f":"LEN(B63)","v":40},"Pidpa 1","Pidpa 4/Pidpa 7/Pidpa 9/Pidpa 11",359.46,458.56,{"$f":"IFERROR(IF(J63<K63,K63,J63),\"\")","v":458.56}]
["Meerhout","Pidpa 1",2450,359.46,"Meerhout"]
["Kasterlee","Pidpa 4/Pidpa 9",2460,401.8,"Kasterlee",{"$f":"SEARCH(\"/\",B65)","v":8},{"$f":"LEN(B65)","v":15},{"$f":"LEFT(B65,F65-1)","v":"Pidpa 4"},{"$f":"MID(B65,F65+1,G65-F65)","v":"Pidpa 9"},401.8,338.74]
["Retie","Pidpa 9",2470,338.74,"Retie"]
["Dessel","Pidpa 9",2480,338.74,{"$f":"A67","v":"Dessel"}]
["Balen","Pidpa 1/Pidpa 7",2490,359.46,"Balen",{"$f":"SEARCH(\"/\",B68)","v":8},{"$f":"LEN(B68)","v":15},{"$f":"LEFT(B68,F68-1)","v":"Pidpa 1"},{"$f":"MID(B68,F68+1,G68-F68)","v":"Pidpa 7"},359.46,312.61]
["Lier","Pidpa 13",2500,451.35,"Lier"]
["Ranst","Pidpa 10/Pidpa 13",2520,587.39,"Ranst",{"$f":"SEARCH(\"/\",B70)","v":9},{"$f":"LEN(B70)","v":17},{"$f":"LEFT(B70,F70-1)","v":"Pidpa 10"},{"$f":"MID(B70,F70+1,G70-F70)","v":"Pidpa 13"},587.39,451.35]
["Boechout","AWW-PST/Pidpa 13",2530,747,"Boechout",{"$f":"SEARCH(\"/\",B71)","v":8},{"$f":"LEN(B71)","v":16},{"$f":"LEFT(B71,F71-1)","v":"AWW-PST"},{"$f":"MID(B71,F71+1,G71-F71)","v":"Pidpa 13"},747,451.35]
["Hove","AWW-PST",2540,747,"Hove"]
["Lint","Pidpa 13",2547,451.35,"Lint"]
["Kontich","AWW-PST/Pidpa 12",2550,747,"Kontich",{"$f":"SEARCH(\"/\",B74)","v":8},{"$f":"LEN(B74)","v":16},{"$f":"LEFT(B74,F74-1)","v":"AWW-PST"},{"$f":"MID(B74,F74+1,G74-F74)","v":"Pidpa 12"},747,480.18]
["Nijlen","Pidpa 13",2560,451.35,"Nijlen"]
["Duffel","Pidpa 12/Pidpa 13",2570,480.18,"Duffel",{"$f":"SEARCH(\"/\",B76)","v":9},{"$f":"LEN(B76)","v":17},{"$f":"LEFT(B76,F76-1)","v":"Pidpa 12"},{"$f":"MID(B76,F76+1,G76-F76)","v":"Pidpa 13"},480.18,451.35]
["Putte","Pidpa 11",2580,458.56,"Putte"]
["Berlaar","Pidpa 13",2590,451.35,"Berlaar"]
["Hemiksem","Pidpa 12",2620,480.18,"Hemiksem"]
["Schelle","Pidpa 12",2627,480.18,"Schelle"]
["Aartselaar","Pidpa 12",2630,480.18,"Aartselaar"]
["Mortsel","AWW-PST",2640,747,"Mortsel"]
["Edegem","AWW-PST",2650,747,"Edegem"]
["Mechelen","Pidpa 13/Pidpa 14",2800,570.27,"Mechelen",{"$f":"SEARCH(\"/\",B84)","v":9},{"$f":"LEN(B84)","v":17},{"$f":"LEFT(B84,F84-1)","v":"Pidpa 13"},{"$f":"MID(B84,F84+1,G84-F84)","v":"Pidpa 14"},451.35,570.27]
["Bonheiden","Pidpa 11",2820,458.56,"Bonheiden"]
["Willebroek","Pidpa 14",2830,570.27,"Willebroek"]
["Rumst","Pidpa 12",2840,480.18,"Rumst"]
["Niel","Pidpa 12",2845,480.18,"Niel"]
["Boom","Pidpa 12",2850,480.18,"Boom"]
["Sint-Katelijne-Waver","Pidpa 11/Pidpa 13",2860,458.56,"Sint-Katelijne-Waver",{"$f":"SEARCH(\"/\",B90)","v":9},{"$f":"LEN(B90)","v":17},{"$f":"LEFT(B90,F90-1)","v":"Pidpa 11"},{"$f":"MID(B90,F90+1,G90-F90)","v":"Pidpa 13"},458.56,451.35]
["Puurs","Pidpa 14",2870,570.27,"Puurs"]
["Bornem","Pidpa 14",2880,570.27,"Bornem"]
["Sint-Amands","Pidpa 14",2890,570.27,"Sint-Amands"]
["Essen","Pidpa 3",2910,441.44,"Essen"]
["Kalmthout","Pidpa 3/Pidpa 6",2920,580.65,"Kalmthout",{"$f":"SEARCH(\"/\",B95)","v":8},{"$f":"LEN(B95)","v":15},{"$f":"LEFT(B95,F95-1)","v":"Pidpa 3"},{"$f":"MID(B95,F95+1,G95-F95)","v":"Pidpa 6"},441.44,580.65]
["Brasschaat","Pidpa 2",2930,499.1,"Brasschaat"]
["Stabroek","Pidpa 6",2940,580.65,"Stabroek"]
["Brecht","Pidpa 2/Pidpa5",2960,499.1,"Brecht",{"$f":"SEARCH(\"/\",B98)","v":8},{"$f":"LEN(B98)","v":14},"Pidpa 2","Pidpa 5",499.1,403.6]
["Schilde","Pidpa 2/Pidpa 5/Pidpa 10",2970,587.39,"Schilde",8,24,"Pidpa 2","Pidpa 10",499.1,587.39,{"$f":"IFERROR(IF(J99<K99,K99,J99),\"\")","v":587.39}]
["Halle","DW B1/IWVB-BFI41/IWVB-EFI35",2980,756,"Halle",6,27,"DW B1","Vivaqua-BFI41",756,704.1]
["Zoersel","Pidpa 4/Pidpa 5",2980,403.6,"Zoersel",8,15,{"$f":"LEFT(B101,F101-1)","v":"Pidpa 4"},{"$f":"MID(B101,F101+1,G101-F101)","v":"Pidpa 5"},401.8,403.6]
["Wuustwezel","Pidpa 5/Pidpa 6",2990,580.65,"Wuustwezel",8,15,{"$f":"LEFT(B102,F102-1)","v":"Pidpa 5"},{"$f":"MID(B102,F102+1,G102-F102)","v":"Pidpa 6"},403.6,580.65]
["Leuven","DW B6/DW B7/DW B16",3000,805,"Leuven",6,18,"DW B6","DW B16",805,706,{"$f":"IFERROR(IF(J103<K103,K103,J103),\"\")","v":805}]
["Herent","DW B5/DW B6",3020,805,"Herent",6,11,{"$f":"LEFT(B104,F104-1)","v":"DW B5"},{"$f":"MID(B104,F104+1,G104-F104)","v":"DW B6"},705.66666666666663,805]
["Huldenberg","DW B7/DW B8",3040,1599,"Huldenberg",6,11,"DW B7","DW B8",797,1599,{"$f":"IFERROR(IF(J105<K105,K105,J105),\"\")","v":1599}]
["Bertem","DW B7",3060,797,"Bertem"]
["Kortenberg","DW B5/IWVB-BFI41",3070,705.66666666666663,"Kortenberg",{"$f":"SEARCH(\"/\",B107)","v":6},{"$f":"LEN(B107)","v":16},"DW B5","Vivaqua-BFI41",705.66666666666663,704.1]
["Tervuren","DW B7/DW B8/IWVB-BFI41",3080,1599,"Tervuren",{"$f":"SEARCH(\"/\",B108)","v":6},{"$f":"LEN(B108)","v":22},"DW B7","DW B8",797,1599,{"$f":"IFERROR(IF(J108<K108,K108,J108),\"\")","v":1599}]
["Overijse","DW B8",3090,1599,"Overijse",null,null,null,null,null,null,{"$f":"IFERROR(IF(J109<K109,K109,J109),\"\")","v":0}]
["Tremelo","DW B4",3120,701.07142857142856,"Tremelo"]
["Begijnendijk","DW B12",3130,594,"Begijnendijk"]
["Keerbergen","DW B4/DW B19",3140,701.07142857142856,"Keerbergen",{"$f":"SEARCH(\"/\",B112)","v":6},{"$f":"LEN(B112)","v":12},{"$f":"LEFT(B112,F112-1)","v":"DW B4"},{"$f":"MID(B112,F112+1,G112-F112)","v":"DW B19"},701.07142857142856,458.56]
["Haacht","DW B4/DW B5",3150,705.66666666666663,"Haacht",{"$f":"SEARCH(\"/\",B113)","v":6},{"$f":"LEN(B113)","v":11},{"$f":"LEFT(B113,F113-1)","v":"DW B4"},{"$f":"MID(B113,F113+1,G113-F113)","v":"DW B5"},701.07142857142856,705.66666666666663]
["Boortmeerbeek","DW B5",3190,705.66666666666663,"Boortmeerbeek"]
["Aarschot","DW B12",3200,594,"Aarschot"]
["Lubbeek","DW B6/DW B9/DW B16",3210,913,"Lubbeek",{"$f":"SEARCH(\"/\",B116)","v":6},{"$f":"LEN(B116)","v":18},"DW B6","DW B9",805,913,{"$f":"IFERROR(IF(J116<K116,K116,J116),\"\")","v":913}]
["Holsbeek","DW B6/DW B12",3220,805,"Holsbeek",{"$f":"SEARCH(\"/\",B117)","v":6},{"$f":"LEN(B117)","v":12},{"$f":"LEFT(B117,F117-1)","v":"DW B6"},{"$f":"MID(B117,F117+1,G117-F117)","v":"DW B12"},805,594]
["Scherpenheuvel-Zcihem","DW B12",3270,594,"Scherpenheuvel-Zcihem"]
["Diest","DW B12/DW B13",3290,658,"Diest",{"$f":"SEARCH(\"/\",B119)","v":7},{"$f":"LEN(B119)","v":13},{"$f":"LEFT(B119,F119-1)","v":"DW B12"},{"$f":"MID(B119,F119+1,G119-F119)","v":"DW B13"},594,658]
["Tienen","DW B9/DW B10/DW B18",3300,913,"Tienen",{"$f":"SEARCH(\"/\",B120)","v":6},{"$f":"LEN(B120)","v":19},"DW B9","DW B10/DW B18",913,0,{"$f":"IFERROR(IF(J120<K120,K120,J120),\"\")","v":913}]
["Hoegaarden","DW B9",3320,913,"Hoegaarden",null,null,null,null,null,null,{"$f":"IFERROR(IF(J121<K121,K121,J121),\"\")","v":0}]
["Linter","DW B18",3350,758,"Linter"]
["Bierbeek","DW B7/DW B16",3360,797,"Bierbeek",{"$f":"SEARCH(\"/\",B123)","v":6},{"$f":"LEN(B123)","v":12},{"$f":"LEFT(B123,F123-1)","v":"DW B7"},{"$f":"MID(B123,F123+1,G123-F123)","v":"DW B16"},797,706]
["Boutersem","DW B9",3370,913,"Boutersem",null,null,null,null,null,null,{"$f":"IFERROR(IF(J124<K124,K124,J124),\"\")","v":0}]
["Glabbeek","DW B9/DW B18",3380,913,"Glabbeek",{"$f":"SEARCH(\"/\",B125)","v":6},{"$f":"LEN(B125)","v":12},{"$f":"LEFT(B125,F125-1)","v":"DW B9"},{"$f":"MID(B125,F125+1,G125-F125)","v":"DW B18"},913,758,{"$f":"IFERROR(IF(J125<K125,K125,J125),\"\")","v":913}]
["Tielt-Winge","DW B12",3390,594,"Tielt-Winge"]
["Landen","DW B11/DW B18",3400,1007,"Landen",{"$f":"SEARCH(\"/\",B127)","v":7},{"$f":"LEN(B127)","v":13},{"$f":"LEFT(B127,F127-1)","v":"DW B11"},{"$f":"MID(B127,F127+1,G127-F127)","v":"DW B18"},1007,758,{"$f":"IFERROR(IF(J127<K127,K127,J127),\"\")","v":1007}]
["Zoutleeuw","DW B18",3440,758,"Zoutleeuw"]
["Geetbets","DW B14",3450,921,"Geetbets",null,null,null,null,null,null,{"$f":"IFERROR(IF(J129<K129,K129,J129),\"\")","v":0}]
["Bekkevoort","DW B12",3460,594,"Bekkevoort"]
["Kortenaken","DW B18",3470,758,{"$f":"A131","v":"Kortenaken"}]
["Hasselt","DW L4/DW L6/DW L17",3500,779,"Hasselt",{"$f":"SEARCH(\"/\",B132)","v":6},{"$f":"LEN(B132)","v":18},"DW L4","DW L17",606,779]
["Zonhoven","DW L6",3520,619,"Zonhoven"]
["Houthalen-Helchteren","DW L6",3530,619,"Houthalen-Helchteren"]
["Halen","DW L4/DW L10",3545,961,"Halen",{"$f":"SEARCH(\"/\",B135)","v":6},{"$f":"LEN(B135)","v":12},{"$f":"LEFT(B135,F135-1)","v":"DW L4"},{"$f":"MID(B135,F135+1,G135-F135)","v":"DW L10"},606,961,{"$f":"IFERROR(IF(J135<K135,K135,J135),\"\")","v":961}]
["Heusden-Zolder","DW L5/DW L6",3550,848,"Heusden-Zolder",6,11,{"$f":"LEFT(B136,F136-1)","v":"DW L5"},{"$f":"MID(B136,F136+1,G136-F136)","v":"DW L6"},848,619,{"$f":"IFERROR(IF(J136<K136,K136,J136),\"\")","v":848}]
["Lummen","DW L1/DW L4/DW L6",3560,619,"Lummen",6,17,"DW L1","DW L6",415,619,{"$f":"IFERROR(IF(J137<K137,K137,J137),\"\")","v":619}]
["Alken","DW L4/DW L10",3570,961,"Alken",6,12,{"$f":"LEFT(B138,F138-1)","v":"DW L4"},{"$f":"MID(B138,F138+1,G138-F138)","v":"DW L10"},606,961,{"$f":"IFERROR(IF(J138<K138,K138,J138),\"\")","v":961}]
["Beringen","DW L1/DW L6",3580,619,"Beringen",6,11,"DW L1","DW L6",415,619]
["Diepenbeek","DW L4/DW L6",3590,619,"Diepenbeek",6,11,"DW L4","DW L6",606,619]
["Genk","DW L4/DW L6",3600,619,"Genk",6,11,"DW L4","DW L6",606,619]
["Lanaken","DW L4/DW L8",3620,609,"Lanaken",6,11,"DW L4","DW L8",606,609]
["Maasmechelen","DW L4/DW L6",3630,619,"Maasmechelen",6,11,"DW L4","DW L6",606,619]
["Kinrooi","DW L4",3640,606,"Kinrooi"]
["Dilsen-Stokkem","DW L4",3650,606,"Dilsen-Stokkem"]
["Opglabbeek","DW L6",3660,619,"Opglabbeek"]
["As","DW L6",3665,619,"As"]
["Meeuwen-Gruitrode","DW L3/DW L6",3670,619,"Meeuwen-Gruitrode",{"$f":"SEARCH(\"/\",B148)","v":6},{"$f":"LEN(B148)","v":11},{"$f":"LEFT(B148,F148-1)","v":"DW L3"},{"$f":"MID(B148,F148+1,G148-F148)","v":"DW L6"},344,619]
["Oud-Turnhout","Pidpa 9",3670,338.74,"Oud-Turnhout"]
["Maaseik","DW L4",3680,606,"Maaseik"]
["Zutendaal","DW L4/DW L6",3690,619,"Zutendaal",{"$f":"SEARCH(\"/\",B151)","v":6},{"$f":"LEN(B151)","v":11},{"$f":"LEFT(B151,F151-1)","v":"DW L4"},{"$f":"MID(B151,F151+1,G151-F151)","v":"DW L6"},606,619]
["Tongeren","DW L7/DW L13/DW L16",3700,966,"Tongeren",{"$f":"SEARCH(\"/\",B152)","v":6},{"$f":"LEN(B152)","v":19},"DW L7","DW L16",896,966,{"$f":"IFERROR(IF(J152<K152,K152,J152),\"\")","v":966}]
["Herstappe","DW L13",3717,966,"Herstappe",null,null,null,null,null,null,{"$f":"IFERROR(IF(J153<K153,K153,J153),\"\")","v":0}]
["Kortessem","DW L7",3720,896,"Kortessem",null,null,null,null,null,null,{"$f":"IFERROR(IF(J154<K154,K154,J154),\"\")","v":0}]
["Hoeselt","DW L7",3730,896,"Hoeselt",null,null,null,null,null,null,{"$f":"IFERROR(IF(J155<K155,K155,J155),\"\")","v":0}]
["Bilzen","DW L8",3740,609,"Bilzen"]
["Riemst","DW L8/DW L14",3770,785,"Riemst",{"$f":"SEARCH(\"/\",B157)","v":6},{"$f":"LEN(B157)","v":12},{"$f":"LEFT(B157,F157-1)","v":"DW L8"},{"$f":"MID(B157,F157+1,G157-F157)","v":"DW L14"},609,785]
["Kapelle op den Bos","DW B3",3770,716,"Kapelle op den Bos"]
["Kapellen","Pidpa 2/Pidpa 6/AWW PST",3770,580.65,"Kapellen",{"$f":"SEARCH(\"/\",B159)","v":8},{"$f":"LEN(B159)","v":23},"Pidpa 2","Pidpa 6",499.1,580.65]
["Voeren","DW L15",3790,314,"Voeren"]
["Sint-Truiden","DW L9/DW L10",3800,961,"Sint-Truiden",{"$f":"SEARCH(\"/\",B161)","v":6},{"$f":"LEN(B161)","v":12},{"$f":"LEFT(B161,F161-1)","v":"DW L9"},{"$f":"MID(B161,F161+1,G161-F161)","v":"DW L10"},959,961,{"$f":"IFERROR(IF(J161<K161,K161,J161),\"\")","v":961}]
["Wellen","DW L10",3830,961,"Wellen",null,null,null,null,null,null,{"$f":"IFERROR(IF(J162<K162,K162,J162),\"\")","v":0}]
["Borgloon","DW L7/DW L12",3840,896,"Borgloon",{"$f":"SEARCH(\"/\",B163)","v":6},{"$f":"LEN(B163)","v":12},{"$f":"LEFT(B163,F163-1)","v":"DW L7"},{"$f":"MID(B163,F163+1,G163-F163)","v":"DW L12"},896,758,{"$f":"IFERROR(IF(J163<K163,K163,J163),\"\")","v":896}]
["Heers","DW L11/DW L12",3870,784,"Heers",{"$f":"SEARCH(\"/\",B164)","v":7},{"$f":"LEN(B164)","v":13},{"$f":"LEFT(B164,F164-1)","v":"DW L11"},{"$f":"MID(B164,F164+1,G164-F164)","v":"DW L12"},784,758]
["Gingelom","DW L11",3890,784,"Gingelom"]
["Overpelt","DW L2",3900,280,"Overpelt"]
["Neerpelt","DW L2",3910,280,"Neerpelt"]
["Lommel","DW L1/DW L2",3920,415,"Lommel",{"$f":"SEARCH(\"/\",B168)","v":6},{"$f":"LEN(B168)","v":11},{"$f":"LEFT(B168,F168-1)","v":"DW L1"},{"$f":"MID(B168,F168+1,G168-F168)","v":"DW L2"},415,280]
["Hamont-Achel","DW L2",3930,280,"Hamont-Achel"]
["Hechtel-Eksel","DW L2",3940,280,"Hechtel-Eksel"]
["Ham","DW L1",3945,415,"Ham"]
["Bocholt","DW L2/DW L3",3950,344,"Bocholt",{"$f":"SEARCH(\"/\",B172)","v":6},{"$f":"LEN(B172)","v":11},{"$f":"LEFT(B172,F172-1)","v":"DW L2"},{"$f":"MID(B172,F172+1,G172-F172)","v":"DW L3"},280,344]
["Bree","DW L3",3960,344,"Bree"]
["Leopoldsburg","DW L1",3970,415,"Leopoldsburg"]
["Tessenderlo","DW L1/DW L6",3980,619,"Tessenderlo",{"$f":"SEARCH(\"/\",B175)","v":6},{"$f":"LEN(B175)","v":11},{"$f":"LEFT(B175,F175-1)","v":"DW L1"},{"$f":"MID(B175,F175+1,G175-F175)","v":"DW L6"},415,619]
["Peer","DW L2",3990,280,"Peer"]
["Schoten","Pidpa 2",4782,499.1,"Schoten"]
["Lo-Reninge","DW WVL7",4987,1101,"Lo-Reninge",null,null,null,null,null,null,{"$f":"IFERROR(IF(J178<K178,K178,J178),\"\")","v":0}]
["Sint- Lievens - Houtem","TMVW LG 2",5377,785,"Sint- Lievens - Houtem"]
["Maarkedal","TMVW LG 1",6238,853,"Maarkedal",null,null,null,null,null,null,{"$f":"IFERROR(IF(J180<K180,K180,J180),\"\")","v":0}]
["Rostelaar","DW B4/DW B6",6730,805,"Rostelaar",{"$f":"SEARCH(\"/\",B181)","v":6},{"$f":"LEN(B181)","v":11},{"$f":"LEFT(B181,F181-1)","v":"DW B4"},{"$f":"MID(B181,F181+1,G181-F181)","v":"DW B6"},701.07142857142856,805]
["Herk De Stad","DW L10",7742,961,"Herk De Stad",null,null,null,null,null,null,{"$f":"IFERROR(IF(J182<K182,K182,J182),\"\")","v":0}]
["Brugge","TMVW LG 1/TMVW LG 2",8000,853,"Brugge",{"$f":"SEARCH(\"/\",B183)","v":10},{"$f":"LEN(B183)","v":19},{"$f":"LEFT(B183,F183-1)","v":"TMVW LG 1"},{"$f":"MID(B183,F183+1,G183-F183)","v":"TMVW LG 2"},853,785,{"$f":"IFERROR(IF(J183<K183,K183,J183),\"\")","v":853}]
["Oostkamp","DW WVL11",8020,712,"Oostkamp"]
["Zedelgem","DW WVL9/DW VL10/DW WVL11",8210,1197,"Zedelgem",{"$f":"SEARCH(\"/\",B185)","v":8},{"$f":"LEN(B185)","v":24},"DW WVL9","DW WVL11",1197,712,{"$f":"IFERROR(IF(J185<K185,K185,J185),\"\")","v":1197}]
["Knokke-Heist","Knokke-Knokke/Knokke-Heist",8300,743,"Knokke-Heist",{"$f":"SEARCH(\"/\",B186)","v":14},{"$f":"LEN(B186)","v":26},{"$f":"LEFT(B186,F186-1)","v":"Knokke-Knokke"},{"$f":"MID(B186,F186+1,G186-F186)","v":"Knokke-Heist"},743,584]
["Damme","TMVW LG 2",8340,785,"Damme"]
["Blankenberge","TMVW LG 2",8370,785,"Blankenberge"]
["Zuienkerke","TMVW LG 2",8377,785,"Zuienkerke"]
["Oostende","DW WVL12/TMVW LG 1",8400,1172,"Oostende",{"$f":"SEARCH(\"/\",B190)","v":9},{"$f":"LEN(B190)","v":18},{"$f":"LEFT(B190,F190-1)","v":"DW WVL12"},{"$f":"MID(B190,F190+1,G190-F190)","v":"TMVW LG 1"},1172,853,{"$f":"IFERROR(IF(J190<K190,K190,J190),\"\")","v":1172}]
["De Haan","TMVW LG 2",8420,785,"De Haan"]
["Middelkerke","DW WVL7/TMVW LG 1",8430,1101,"Middelkerke",{"$f":"SEARCH(\"/\",B192)","v":8},{"$f":"LEN(B192)","v":17},{"$f":"LEFT(B192,F192-1)","v":"DW WVL7"},{"$f":"MID(B192,F192+1,G192-F192)","v":"TMVW LG 1"},1101,853,{"$f":"IFERROR(IF(J192<K192,K192,J192),\"\")","v":1101}]
["Bredene","DW WVL12",8450,1172,"Bredene",null,null,null,null,null,null,0]
["Oudenburg","DW WVL12",8460,1172,"Oudenburg",null,null,null,null,null,null,0]
["Gistel","DW WVL7",8470,1101,{"$f":"A195","v":"Gistel"},null,null,null,null,null,null,0]
["Ichtegem","DW WVL7",8480,1101,"Ichtegem",null,null,null,null,null,null,0]
["Jabbeke","DW WVL10/TMVW LG 1",8490,853,"Jabbeke",{"$f":"SEARCH(\"/\",B197)","v":9},{"$f":"LEN(B197)","v":18},{"$f":"LEFT(B197,F197-1)","v":"DW WVL10"},{"$f":"MID(B197,F197+1,G197-F197)","v":"TMVW LG 1"},712,853,853]
["Kortrijk","DW WVL3/DW WVL4",8500,888,"Kortrijk",{"$f":"SEARCH(\"/\",B198)","v":8},{"$f":"LEN(B198)","v":15},{"$f":"LEFT(B198,F198-1)","v":"DW WVL3"},{"$f":"MID(B198,F198+1,G198-F198)","v":"DW WVL4"},888,848,888]
["Kuurne","DW WVL2",8520,820,"Kuurne"]
["Harelbeke","DW WVL2",8530,820,"Harelbeke"]
["Deerlijk","DW WVL2",8540,820,"Deerlijk"]
["Zwevegem","DW WVL2/DW WVL4",8550,848,"Zwevegem",{"$f":"SEARCH(\"/\",B202)","v":8},{"$f":"LEN(B202)","v":15},{"$f":"LEFT(B202,F202-1)","v":"DW WVL2"},{"$f":"MID(B202,F202+1,G202-F202)","v":"DW WVL4"},820,848,{"$f":"IFERROR(IF(J202<K202,K202,J202),\"\")","v":848}]
["Wevelgem","DW WVL3/DW WVL4",8560,888,"Wevelgem",{"$f":"SEARCH(\"/\",B203)","v":8},{"$f":"LEN(B203)","v":15},{"$f":"LEFT(B203,F203-1)","v":"DW WVL3"},{"$f":"MID(B203,F203+1,G203-F203)","v":"DW WVL4"},888,848,{"$f":"IFERROR(IF(J203<K203,K203,J203),\"\")","v":888}]
["Wezembeek-Oppem","Vivaqua-BFI41",8560,704.1,"Wezembeek-Oppem",{"$f":"SEARCH(\"/\",B204)","v":{"$error":"#VALUE!"}},{"$f":"LEN(B204)","v":13},{"$f":"LEFT(B204,F204-1)","v":{"$error":"#VALUE!"}},{"$f":"MID(B204,F204+1,G204-F204)","v":{"$error":"#VALUE!"}},{"$error":"#VALUE!"},{"$error":"#VALUE!"}]
["Anzegem","DW WVL1",8570,830.5,"Anzegem"]
["Avelgem","DW WVL1",8580,830.5,"Avelgem"]
["Spiere-Helkijn","DW WVL4",8587,848,"Spiere-Helkijn"]
["Diksmuide","IWVA/DW WVL7/DW WVL9",8600,1384,"Diksmuide",{"$f":"SEARCH(\"/\",B208)","v":5},{"$f":"LEN(B208)","v":20},"IWVA","DW WVL7/DW WVL9",1384,0,{"$f":"IFERROR(IF(J208<K208,K208,J208),\"\")","v":1384}]
["Kortemark","DW WVL9",8610,1197,"Kortemark",null,null,null,null,null,null,0]
["Nieuwpoort","IWVA",8620,1384,"Nieuwpoort",null,null,null,null,null,null,0]
["Veurne","IWVA",8630,1384,"Veurne",null,null,null,null,null,null,0]
["Vleteren","DW WVL7",8640,1101,"Vleteren",null,null,null,null,null,null,0]
["Houthulst","DW WVL7/DW WVL9",8650,1197,"Houthulst",{"$f":"SEARCH(\"/\",B213)","v":8},{"$f":"LEN(B213)","v":15},{"$f":"LEFT(B213,F213-1)","v":"DW WVL7"},{"$f":"MID(B213,F213+1,G213-F213)","v":"DW WVL9"},1101,1197,1197]
["De Panne","IWVA",8660,1384,"De Panne",null,null,null,null,null,null,0]
["Koksijde","IWVA",8670,1384,"Koksijde",null,null,null,null,null,null,0]
["Koekelare","DW WVL7",8680,1101,"Koekelare",null,null,null,null,null,null,0]
["Alveringem","IWVA",8690,1384,"Alveringem",null,null,null,null,null,null,0]
["Tielt","DW WVL6",8700,851,"Tielt",null,null,null,null,null,null,0]
["Wielsbeke","DW WVL2",8710,820,"Wielsbeke"]
["Dentergem","DW WVL2",8720,820,"Dentergem"]
["Beernem","TMVW LG 1/TMVW LG 2",8730,853,"Beernem",{"$f":"SEARCH(\"/\",B221)","v":10},{"$f":"LEN(B221)","v":19},{"$f":"LEFT(B221,F221-1)","v":"TMVW LG 1"},{"$f":"MID(B221,F221+1,G221-F221)","v":"TMVW LG 2"},853,785,{"$f":"IFERROR(IF(J221<K221,K221,J221),\"\")","v":853}]
["Pittem","DW WVL6",8740,851,"Pittem",null,null,null,null,null,null,{"$f":"IFERROR(IF(J222<K222,K222,J222),\"\")","v":0}]
["Wingene","DW WVL9/DW WVL11",8750,1197,"Wingene",{"$f":"SEARCH(\"/\",B223)","v":8},{"$f":"LEN(B223)","v":16},{"$f":"LEFT(B223,F223-1)","v":"DW WVL9"},{"$f":"MID(B223,F223+1,G223-F223)","v":"DW WVL11"},1197,712,{"$f":"IFERROR(IF(J223<K223,K223,J223),\"\")","v":1197}]
["Ruiselede","TMVW LG 1",8755,853,"Ruiselede",null,null,null,null,null,null,{"$f":"IFERROR(IF(J224<K224,K224,J224),\"\")","v":0}]
["Meulebeke","DW WVL2",8760,820,"Meulebeke"]
["Ingelmunster","DW WVL3",8770,888,"Ingelmunster",null,null,null,null,null,null,{"$f":"IFERROR(IF(J226<K226,K226,J226),\"\")","v":0}]
["Oostrozebeke","DW WVL2",8780,820,"Oostrozebeke"]
["Waregem","DW WVL1/DW WVL2",8790,830.5,"Waregem",{"$f":"SEARCH(\"/\",B228)","v":8},{"$f":"LEN(B228)","v":15},{"$f":"LEFT(B228,F228-1)","v":"DW WVL1"},{"$f":"MID(B228,F228+1,G228-F228)","v":"DW WVL2"},830.5,820]
["Beveren","DW OVL5/AWW PST",8800,747,"Beveren",{"$f":"SEARCH(\"/\",B229)","v":8},{"$f":"LEN(B229)","v":15},"DW OVL5","AWW-PST",701,747,{"$f":"IFERROR(IF(J229<K229,K229,J229),\"\")","v":747}]
["Roeselare","DW WVL3/ DW WVL5",8800,910.2,"Roeselare",{"$f":"SEARCH(\"/\",B230)","v":8},{"$f":"LEN(B230)","v":16},"DW WVL3","DW WVL5",888,910.2,910.2]
["Lichtervelde","DW WVL9",8810,1197,"Lichtervelde",null,null,null,null,null,null,0]
["Torhout","DW WVL9",8820,1197,"Torhout",null,null,null,null,null,null,0]
["Hooglede","DW WVL9",8830,1197,"Hooglede",null,null,null,null,null,null,0]
["Staden","DW WVL5/DW WVL9",8840,1197,"Staden",{"$f":"SEARCH(\"/\",B234)","v":8},{"$f":"LEN(B234)","v":15},{"$f":"LEFT(B234,F234-1)","v":"DW WVL5"},{"$f":"MID(B234,F234+1,G234-F234)","v":"DW WVL9"},910.2,1197,1197]
["Ardooie","DW WVL9",8850,1197,"Ardooie",null,null,null,null,null,null,0]
["Lendelede","DW WVL3",8860,888,"Lendelede",null,null,null,null,null,null,0]
["Izegem","DW WVL3",8870,888,"Izegem",null,null,null,null,null,null,0]
["Ledegem","DW WVL4",8880,848,"Ledegem"]
["Moorslede","DW WVL4",8890,848,"Moorslede"]
["Ieper ","DW WVL7/DW WVL8/DW WVL13",8900,1101,"Ieper ",{"$f":"SEARCH(\"/\",B240)","v":8},{"$f":"LEN(B240)","v":24},"DW WVL7","DW WVL13",1101,870,{"$f":"IFERROR(IF(J240<K240,K240,J240),\"\")","v":1101}]
["Langemark-Poelkapelle","DW WVL7",8920,1101,"Langemark-Poelkapelle",null,null,null,null,null,null,{"$f":"IFERROR(IF(J241<K241,K241,J241),\"\")","v":0}]
["Menen","DW WVL4",8930,848,"Menen"]
["Wervik","DW WVL4",8940,848,"Wervik"]
["Heuvelland","DW WVL8",8950,989,"Heuvelland",null,null,null,null,null,null,{"$f":"IFERROR(IF(J244<K244,K244,J244),\"\")","v":0}]
["Mesen","DW WVL8",8957,989,"Mesen",null,null,null,null,null,null,{"$f":"IFERROR(IF(J245<K245,K245,J245),\"\")","v":0}]
["Poperinge","DW WVL7/DW WVL 8",8970,1101,"Poperinge",{"$f":"SEARCH(\"/\",B246)","v":8},{"$f":"LEN(B246)","v":16},"DW WVL7","DW WVL 8",1101,0,{"$f":"IFERROR(IF(J246<K246,K246,J246),\"\")","v":1101}]
["Zonnebeke","DW WVL8",8980,989,"Zonnebeke",null,null,null,null,null,null,{"$f":"IFERROR(IF(J247<K247,K247,J247),\"\")","v":0}]
["Gent","TMVW LG 2",9000,785,"Gent"]
["Zelzate","TMVW LG 2",9060,785,"Zelzate"]
["Destelbergen","TMVW LG 3",9070,684,"Destelbergen"]
["Lochristi","DW OVL4/TMVW LG 3",9080,809,"Lochristi",{"$f":"SEARCH(\"/\",B251)","v":8},{"$f":"LEN(B251)","v":17},{"$f":"LEFT(B251,F251-1)","v":"DW OVL4"},{"$f":"MID(B251,F251+1,G251-F251)","v":"TMVW LG 3"},809,684]
["Melle","TMVW LG 2",9090,785,"Melle"]
["Sint-Niklaas","DW OVL3/DW OVL4/DW OVL9",9100,1229,"Sint-Niklaas",{"$f":"SEARCH(\"/\",B253)","v":8},{"$f":"LEN(B253)","v":23},"DW OVL3","DW OVL4/DW OVL9",1229,0,{"$f":"IFERROR(IF(J253<K253,K253,J253),\"\")","v":1229}]
["Temse","DW OVL5",9140,701,"Temse"]
["Kruibeke","DW OVL5",9150,701,"Kruibeke"]
["Lokeren","DW OVL3/DW OVL4",9160,1229,"Lokeren",{"$f":"SEARCH(\"/\",B256)","v":8},{"$f":"LEN(B256)","v":15},{"$f":"LEFT(B256,F256-1)","v":"DW OVL3"},{"$f":"MID(B256,F256+1,G256-F256)","v":"DW OVL4"},1229,809,{"$f":"IFERROR(IF(J256<K256,K256,J256),\"\")","v":1229}]
["Sint-Gillis-Waas","DW OVL3/DW OVL4",9170,1229,"Sint-Gillis-Waas",{"$f":"SEARCH(\"/\",B257)","v":8},{"$f":"LEN(B257)","v":15},{"$f":"LEFT(B257,F257-1)","v":"DW OVL3"},{"$f":"MID(B257,F257+1,G257-F257)","v":"DW OVL4"},1229,809,{"$f":"IFERROR(IF(J257<K257,K257,J257),\"\")","v":1229}]
["Moerbeke-Waas","DW OVL3",9180,1229,"Moerbeke-Waas",null,null,null,null,null,null,{"$f":"IFERROR(IF(J258<K258,K258,J258),\"\")","v":0}]
["Wachtebeke","DW OVL3/DW OVL4",9185,1229,{"$f":"A259","v":"Wachtebeke"},{"$f":"SEARCH(\"/\",B259)","v":8},{"$f":"LEN(B259)","v":15},{"$f":"LEFT(B259,F259-1)","v":"DW OVL3"},{"$f":"MID(B259,F259+1,G259-F259)","v":"DW OVL4"},1229,809,{"$f":"IFERROR(IF(J259<K259,K259,J259),\"\")","v":1229}]
["Stekene","DW OVL3/DW OVL4",9190,1229,"Stekene",{"$f":"SEARCH(\"/\",B260)","v":8},{"$f":"LEN(B260)","v":15},{"$f":"LEFT(B260,F260-1)","v":"DW OVL3"},{"$f":"MID(B260,F260+1,G260-F260)","v":"DW OVL4"},1229,809,{"$f":"IFERROR(IF(J260<K260,K260,J260),\"\")","v":1229}]
["Dendermonde","TMVW LG 3",9200,684,"Dendermonde"]
["Hamme","TMVW LG 3",9220,684,"Hamme"]
["Wetteren","TMVW LG 2",9230,785,"Wetteren"]
["Zele","DW OVL4",9240,809,"Zele"]
["Waasmunster","DW OVL4",9250,809,"Waasmunster"]
["Buggenhout","TMVW LG 3",9255,684,"Buggenhout"]
["Wichelen","TMVW LG 2/TMVW LG 3",9260,785,"Wichelen",{"$f":"SEARCH(\"/\",B267)","v":10},{"$f":"LEN(B267)","v":19},{"$f":"LEFT(B267,F267-1)","v":"TMVW LG 2"},{"$f":"MID(B267,F267+1,G267-F267)","v":"TMVW LG 3"},785,684]
["Laarne","DW OVL7",9270,692,"Laarne"]
["Lebbeke","TMVW LG 3",9280,684,"Lebbeke"]
["Berlare","DW OVL7",9290,692,"Berlare"]
["Aalst","TMVW LG 2",9300,785,"Aalst"]
["Nieuwerkerken","DW L10",9320,961,"Nieuwerkerken",null,null,null,null,null,null,{"$f":"IFERROR(IF(J272<K272,K272,J272),\"\")","v":0}]
["Lede","TMVW LG 2",9340,785,"Lede"]
["Ninove","DW OVL6",9400,769,"Ninove"]
["Erpe-Mere","TMVW LG 2",9420,785,"Erpe-Mere"]
["Haaltert","DW OVL6/TMVW LG 2",9450,785,"Haaltert",{"$f":"SEARCH(\"/\",B276)","v":8},{"$f":"LEN(B276)","v":17},{"$f":"LEFT(B276,F276-1)","v":"DW OVL6"},{"$f":"MID(B276,F276+1,G276-F276)","v":"TMVW LG 2"},769,785]
["Denderleeuw","DW OVL6",9470,769,"Denderleeuw"]
["Geraardsbergen","DW OVL6",9500,769,"Geraardsbergen"]
["Herzele","DW OVL6/TMVW LG 2",9550,785,"Herzele",{"$f":"SEARCH(\"/\",B279)","v":8},{"$f":"LEN(B279)","v":17},{"$f":"LEFT(B279,F279-1)","v":"DW OVL6"},{"$f":"MID(B279,F279+1,G279-F279)","v":"TMVW LG 2"},769,785]
["Lierde","DW OVL6/TMVW LG 1",9570,853,"Lierde",{"$f":"SEARCH(\"/\",B280)","v":8},{"$f":"LEN(B280)","v":17},{"$f":"LEFT(B280,F280-1)","v":"DW OVL6"},{"$f":"MID(B280,F280+1,G280-F280)","v":"TMVW LG 1"},769,853,{"$f":"IFERROR(IF(J280<K280,K280,J280),\"\")","v":853}]
["Ronse","TMVW LG 4",9600,957,"Ronse",null,null,null,null,null,null,0]
["Zottegem","TMVW LG 1",9620,853,"Zottegem",null,null,null,null,null,null,0]
["Zwalm","TMVW LG 1",9630,853,"Zwalm",null,null,null,null,null,null,0]
["Brakel","TMVW LG 1",9660,853,"Brakel",null,null,null,null,null,null,0]
["Horebeke","TMVW LG 1",9667,853,"Horebeke",null,null,null,null,null,null,0]
["Kluisbergen","TMVW LG 1",9690,853,"Kluisbergen",null,null,null,null,null,null,0]
["Oudenaarde","TMVW LG 5/TMVW LG 1",9700,873,"Oudenaarde",{"$f":"SEARCH(\"/\",B287)","v":10},{"$f":"LEN(B287)","v":19},{"$f":"LEFT(B287,F287-1)","v":"TMVW LG 5"},{"$f":"MID(B287,F287+1,G287-F287)","v":"TMVW LG 1"},873,853,873]
["Zingem","TMVW LG 1",9750,853,"Zingem",null,null,null,null,null,null,0]
["Kruishoutem","TMVW LG 1",9770,853,"Kruishoutem",null,null,null,null,null,null,0]
["Wortegem-Petegem","TMVW LG 1",9790,853,"Wortegem-Petegem",null,null,null,null,null,null,0]
["Deinze","TMVW LG 1",9800,853,"Deinze",null,null,null,null,null,null,0]
["Nazareth","TMVW LG 1",9810,853,"Nazareth",null,null,null,null,null,null,0]
["Merelbeke","TMVW LG 1",9820,853,"Merelbeke",null,null,null,null,null,null,0]
["Sint-Martens-Latem","TMVW LG 1",9830,853,"Sint-Martens-Latem",null,null,null,null,null,null,0]
["De Pinte","TMVW LG 1",9840,853,"De Pinte",null,null,null,null,null,null,0]
["Nevele","TMVW LG 1/TMVW LG 2",9850,853,"Nevele",{"$f":"SEARCH(\"/\",B296)","v":10},{"$f":"LEN(B296)","v":19},{"$f":"LEFT(B296,F296-1)","v":"TMVW LG 1"},{"$f":"MID(B296,F296+1,G296-F296)","v":"TMVW LG 2"},853,785,853]
["Oosterzele","TMVW LG 2",9860,785,"Oosterzele"]
["Zulte","TMVW LG 1",9870,853,"Zulte",null,null,null,null,null,null,{"$f":"IFERROR(IF(J298<K298,K298,J298),\"\")","v":0}]
["Machelen","TMVW LG 7/IWVB-BFI41",9870,708,"Machelen",{"$f":"SEARCH(\"/\",B299)","v":10},{"$f":"LEN(B299)","v":20},"TMVW LG 7","Vivaqua-BFI41",708,704.1]
["Aalter","TMVW LG 1",9880,853,"Aalter",null,null,null,null,null,null,{"$f":"IFERROR(IF(J300<K300,K300,J300),\"\")","v":0}]
["Gavere","TMVW LG 1",9890,853,"Gavere",null,null,null,null,null,null,{"$f":"IFERROR(IF(J301<K301,K301,J301),\"\")","v":0}]
["Eeklo","DW OVL1/DW OVL2",9900,891,"Eeklo",{"$f":"SEARCH(\"/\",B302)","v":8},{"$f":"LEN(B302)","v":15},{"$f":"LEFT(B302,F302-1)","v":"DW OVL1"},{"$f":"MID(B302,F302+1,G302-F302)","v":"DW OVL2"},809,891,{"$f":"IFERROR(IF(J302<K302,K302,J302),\"\")","v":891}]
["Knesselare","TMVW LG 2",9910,785,"Knesselare"]
["Lovendegem","TMVW LG 2",9920,785,"Lovendegem"]
["Zomergem","TMVW LG 2",9930,785,"Zomergem"]
["Evergem","DW OVL1",9940,809,"Evergem"]
["Waarschoot","DW OVL1",9950,809,"Waarschoot"]
["Assenede","DW OVL1 / DW OVL8",9960,809,"Assenede",{"$f":"SEARCH(\"/\",B308)","v":9},{"$f":"LEN(B308)","v":17},"DW OVL1","DW OVL8",809,809]
["Kaprijke","DW OVL1",9970,809,"Kaprijke"]
["Sint-Laureins","DW OVL1/DW OVL2",9980,891,"Sint-Laureins",{"$f":"SEARCH(\"/\",B310)","v":8},{"$f":"LEN(B310)","v":15},{"$f":"LEFT(B310,F310-1)","v":"DW OVL1"},{"$f":"MID(B310,F310+1,G310-F310)","v":"DW OVL2"},809,891,{"$f":"IFERROR(IF(J310<K310,K310,J310),\"\")","v":891}]
["Maldegem","DW OVL2",9990,891,"Maldegem",null,null,null,null,null,null,{"$f":"IFERROR(IF(J311<K311,K311,J311),\"\")","v":0}]
[null,null,null,null,0,{"$f":"SEARCH(\"/\",B312)","v":{"$error":"#VALUE!"}},{"$f":"LEN(B312)","v":0}]
[null,null,null,null,0,{"$error":"#VALUE!"},0]
[null,null,null,null,0,{"$error":"#VALUE!"},0]
[null,null,null,null,0,{"$error":"#VALUE!"},0]
[null,null,null,null,0,{"$error":"#VALUE!"},0]
[null,null,null,null,0,{"$error":"#VALUE!"},0]
[null,null,null,null,0,{"$error":"#VALUE!"},0]
[null,null,null,null,0,{"$error":"#VALUE!"},0]
[null,null,null,null,0,{"$error":"#VALUE!"},0]

{"sheet":"Data","index":11,"n_rows":11,"n_cols":5,"rows_kept":11,"cut":false,"hidden":true,"merged":[]}
["artnr","VES Patrone","nl","fr","prijs"]
[7738330145,{"$f":"IF(Talen!$A$1=1,C2,D2)","v":"VES Kit P4000 Profi"},"VES Kit P4000 Profi","VES Kit P4000 Profi",802.67]
[7738330146,{"$f":"IF(Talen!$A$1=1,C3,D3)","v":"VES Kit P8000 Profi"},"VES Kit P8000 Profi","VES Kit P8000 Profi",1040.29]
[7738329421,{"$f":"IF(Talen!$A$1=1,C4,D4)","v":"NFK2 vulinrichting"},"NFK2 vulinrichting","Dispositif de remplissage NFK2",259]
[7738330149,{"$f":"IF(Talen!$A$1=1,C5,D5)","v":"Navulverpakking NF8000"},"Navulverpakking NF8000","Pack de recharge Logafix NF8000",144.25]
[7739453970,{"$f":"IF(Talen!$A$1=1,C6,D6)","v":"Water basisdienst ASA"},"Water basisdienst ASA","Eau service de base ASA",797]
[7739453971,{"$f":"IF(Talen!$A$1=1,C7,D7)","v":"Water dienst ASA+1 wissel"},"Water dienst ASA+1 wissel","Eau service ASA+1 chang",953]
[7739453972,{"$f":"IF(Talen!$A$1=1,C8,D8)","v":"Water controle+harswissel"},"Water controle+harswissel","Eau controle+chang resine",183]
[7739453973,{"$f":"IF(Talen!$A$1=1,C9,D9)","v":"Water waarborg bypassunit"},"Water waarborg bypassunit","Eau caution unite bypass",500]
[7739453974,{"$f":"IF(Talen!$A$1=1,C10,D10)","v":"Hars"},"Hars","Resine",10.3]
[7738330148,{"$f":"IF(Talen!$A$1=1,C11,D11)","v":"Navulverpakking NF2000"},"Navulverpakking NF2000","Pack de recharge Logafix NF2000",53.61]