{"text_format":"1","workbook":"xlsx","n_sheets":12,"sheets":["Startpagina","Waterinhoud installatie","ingave waterinhoud","Berekening waterinhoud","Keuze methode","Via µScm","Volgens Postcode","Materialen","Materialen (2)","Talen","Leveringsgebieden","Data"],"not_rendered":{"charts":0,"images":45,"macros":1,"external_links":0,"defined_names":3,"comments":0,"pivot_tables":0},"unopened":[],"bounds":{"document_bytes":16777216,"sheet_cells":100000,"rows_first":2000,"rows_last":500,"rows_between":2000,"halvings":0,"cell_chars":16384,"cell_head_chars":4096},"cells_cut":0,"cells_raw":0,"read":"whole","date_system":"1900"}

{"sheet":"Startpagina","index":0,"n_rows":2,"n_cols":2,"rows_kept":2,"cut":false,"hidden":false,"merged":[]}
[null,{"$f":"Talen!B3","v":"Capaciteitsberekening voor VES patronen"}]
[null,{"$f":"Talen!C3","v":"Calcul de la capacité des cartouches VES"}]

{"sheet":"Waterinhoud installatie","index":1,"n_rows":5,"n_cols":4,"rows_kept":5,"cut":false,"hidden":true,"merged":[]}
[{"$f":"Talen!A7","v":"Stap 1: Totale vermogen installatie "}]
[]
[{"$f":"Talen!A5","v":"Totaal vermogen installatie"},null,600,"kW"]
[]
[{"$f":"Talen!A6","v":"Waterinhoud gekend:"}]

{"sheet":"ingave waterinhoud","index":2,"n_rows":3,"n_cols":4,"rows_kept":3,"cut":false,"hidden":true,"merged":[]}
[{"$f":"Talen!A14","v":"Stap 2 : Ingave waterinhoud"}]
[]
[{"$f":"Talen!A13","v":"Geef de totale waterinhoud"},null,50,{"$f":"Talen!A12","v":"Liter"}]

{"sheet":"Berekening waterinhoud","index":3,"n_rows":40,"n_cols":9,"rows_kept":40,"cut":false,"hidden":true,"merged":[[16,0,16,4],[39,0,39,1],[7,5,7,6],[14,0,14,8],[0,0,0,7],[4,0,4,1],[5,0,5,1],[6,0,6,1],[7,0,7,1],[6,5,6,6],[9,5,9,8]]}
[{"$f":"Talen!A15","v":"Stap 2 : Berekening waterinhoud"}]
[]
[{"$f":"Talen!A19","v":"2.1 : Waterinhoud installatie berekenen:"}]
[]
[{"$f":"Talen!A20","v":"Waterinhoud ketel"},null,null,500,"L"]
[{"$f":"Talen!A21","v":"Inhoud buffervaten indien aanwezig"},null,null,null,"L"]
[{"$f":"Talen!A22","v":"Vermogen kringen  vloerverwarming"},null,null,"kW",null,{"$f":"Talen!A25","v":"Vermogen kringen sierradiatoren"},null,null,"kW"]
[{"$f":"Talen!A23","v":"vermogen kringen paneelradiatoren"},null,null,"kW",null,{"$f":"Talen!A26","v":"Vermogen kringen convectoren"},null,null,"kW"]
[]
[{"$f":"Talen!A24","v":"Waterinhoud installatie zonder leidingen"},null,null,{"$f":"IFERROR(D5+D6+(C7*18.5)+(C8*8.8)+(H7*12)+(H8*5.2),Talen!A27)","v":500},"L",{"$f":"IF(D10>0,\"\",Talen!A39)","v":""}]
[]
[]
[]
[]
[]
[{"$f":"Talen!A33","v":"Rekentool waterinhoud leidingen"}]
[{"$f":"Talen!A28","v":"Waterinhoud leidingen bepalen"}]
["DN",{"$f":"Talen!A29","v":"Duim"},{"$f":"Talen!A30","v":"l/m"},{"$f":"Talen!A31","v":"meter m"},{"$f":"Talen!A32","v":"Inhoud L"}]
[15,"1/2\"",0.2,null,{"$f":"C19*D19","v":0}]
[20,"3/4\"",0.37,null,0]
[25,"1\"",0.57999999999999996,null,0]
[32,"5/4\"",1.01,null,0]
[40,"6/4\"",1.37,null,0]
[50,"2\"",2.21,null,0]
[65,"2 1/2\"",3.9,null,0]
[80,"3\"",5.3,null,0]
[100,"4\"",9,null,0]
[125,"5\"",13.6,null,0]
[150,"6\"",20,null,0]
[200,"8\"",33.6,null,0]
[250,"10\"",53.2,null,0]
[300,"12\"",71.5,null,0]
[350,"14\"",90.5,null,0]
[400,"16\"",118,null,0]
["TOTAAL inhoud",null,null,null,{"$f":"SUM(E19:E34)","v":0}]
[]
[]
[{"$f":"Talen!A34","v":"Waterinhoud leidingen"},null,null,100,"L"]
[]
["totaal Volume",null,null,{"$f":"D38+D10","v":600},"L "]

{"sheet":"Keuze methode","index":4,"n_rows":1,"n_cols":1,"rows_kept":1,"cut":false,"hidden":true,"merged":[]}
[{"$f":"Talen!A40","v":"Stap 3 : kies uw berekingswijze"}]

{"sheet":"Via µScm","index":5,"n_rows":9,"n_cols":4,"rows_kept":9,"cut":false,"hidden":true,"merged":[[3,0,3,2],[4,0,4,2],[5,0,5,2],[6,0,6,2],[8,0,9,8]]}
[{"$f":"Talen!A43","v":"Stap 4 : Berekening via geleidbaarheid van het vulwater in µS/cm"}]
[]
[]
[{"$f":"Talen!A44","v":"Geleidbaarheid in µS/cm:"},null,null,500]
[{"$f":"Talen!A45","v":"Installatie-inhoud in L"},null,null,50]
[]
[{"$f":"Talen!A46","v":"Benodigde capaciteit"},null,null,{"$f":"D4*D5/30","v":833.33333333333337}]
[]
[{"$f":"IF(D4=\"\",\"\",IF('Waterinhoud installatie'!C3>599,Talen!A59,IF(D7<16001,Talen!A58,Talen!A59)))","v":"Waterbehandeling noodzakelijk"}]

{"sheet":"Volgens Postcode","index":6,"n_rows":15,"n_cols":6,"rows_kept":15,"cut":false,"hidden":true,"merged":[[14,0,15,8],[3,0,3,2],[9,0,9,2],[10,0,10,2],[11,0,11,2],[6,0,7,2]]}
[{"$f":"Talen!A54","v":"Stap 4 : Berekening via postnummer installatie-adres"}]
[]
[]
[{"$f":"Talen!A55","v":"Postnummer"},null,null,2800,null,{"$f":"VLOOKUP(D4,Leveringsgebieden!C2:E311,3,)","v":"Mechelen"}]
[]
[]
[{"$f":"Talen!A56","v":"Geleidbaarheid in µS/cm voor deze postnr:"}]
[null,null,null,{"$f":"VLOOKUP(D4,Leveringsgebieden!C2:D311,2,0)","v":570.27}]
[]
[{"$f":"Talen!A45","v":"Installatie-inhoud in L"},null,null,50]
[]
[{"$f":"Talen!A46","v":"Benodigde capaciteit"},null,null,{"$f":"D8*D10/30","v":950.45}]
[]
[]
[{"$f":"IF('Waterinhoud installatie'!C3>599,Talen!A59,IF(D12<16001,Talen!A58,Talen!A59))","v":"Waterbehandeling noodzakelijk"}]

{"sheet":"Materialen","index":7,"n_rows":24,"n_cols":8,"rows_kept":24,"cut":false,"hidden":true,"merged":[[22,3,22,5],[23,3,23,5],[11,0,11,2],[13,0,13,2],[12,0,12,2],[14,0,14,2],[19,3,19,5],[21,3,21,5]]}
[]
[]
[]
[]
[]
[]
[]
[]
[{"$f":"Talen!A62","v":"Stap 5 : Keuze van materiaal"}]
[]
[]
[{"$f":"Talen!A5","v":"Totaal vermogen installatie"},null,null,{"$f":"'Waterinhoud installatie'!C3","v":600},"kW"]
[{"$f":"Talen!A45","v":"Installatie-inhoud in L"},null,null,{"$f":"'ingave waterinhoud'!C3","v":50}]
[{"$f":"Talen!A44","v":"Geleidbaarheid in µS/cm:"},null,null,480.18]
[{"$f":"Talen!A46","v":"Benodigde capaciteit"},null,null,808303]
[]
[]
[]
[{"$f":"Talen!A47","v":"Benodigde Materialen:"}]
[null,null,{"$f":"Talen!A48","v":"Artikelnummer"},{"$f":"Talen!A49","v":"Omschrijving"},null,null,{"$f":"Talen!A50","v":"aantal"},{"$f":"Talen!A51","v":"prijs"}]
[]
[null,null,{"$f":"Data!A4","v":7738329421},{"$f":"Data!C4","v":"NFK2 vulinrichting"},null,null,1,{"$f":"G22*Data!E4","v":259}]
[null,null,{"$f":"IF(D15<16001,Data!A2,IF(D15<40001,Data!A2,IF(D15<1000000000,Data!A3)))","v":7738330146},{"$f":"VLOOKUP(C23,Data!$A$2:$E$42,2,)","v":"VES Kit P8000 Profi"},null,null,1,{"$f":"VLOOKUP(C23,Data!A2:E10,5,)","v":1040.29}]
[null,null,{"$f":"IF(D15<16001,Data!A11,IF(D15<40001,Data!A11,IF(D15<1000000000,Data!A5)))","v":7738330149},{"$f":"VLOOKUP(C24,Data!$A$2:$E$42,2,)","v":"Navulverpakking NF8000"},null,null,{"$f":"IF(IF(C23=Data!A2,ROUNDUP((((ROUNDUP((D15/72000*60)*1.05,0))-2)/2),0),ROUNDUP((ROUNDUP((D15/72000*60)*1.05,0)-14)/7,0))<0,0,IF(C23=Data!A2,ROUNDUP((((ROUNDUP((D15/72000*60)*1.05,0))-2)/2),0),ROUNDUP((ROUNDUP((D15/72000*60)*1.05,0)-14)/7,0)))","v":100},{"$f":"G24*(Data!E5)","v":14425}]

{"sheet":"Materialen (2)","index":8,"n_rows":29,"n_cols":9,"rows_kept":29,"cut":false,"hidden":true,"merged":[[27,3,27,5],[10,0,10,2],[21,3,21,5],[23,3,23,5],[28,3,28,5],[24,3,24,5],[25,3,25,5],[16,0,16,3],[17,0,17,3],[26,3,26,5]]}
[]
[]
[]
[]
[]
[]
[]
[]
[{"$f":"Talen!A62","v":"Stap 5 : Keuze van materiaal"}]
[]
[{"$f":"Talen!A5","v":"Totaal vermogen installatie"},null,null,null,{"$f":"'Waterinhoud installatie'!C3","v":600},"kW"]
[{"$f":"Talen!A45","v":"Installatie-inhoud in L"},null,null,null,{"$f":"'ingave waterinhoud'!C3","v":50},{"$f":"F17","v":"Liter"}]
[{"$f":"Talen!A44","v":"Geleidbaarheid in µS/cm:"},null,null,null,500]
[{"$f":"Talen!A46","v":"Benodigde capaciteit"},null,null,null,841666.66666666663]
[{"$f":"Talen!A66","v":"Debiet pomp bypassunit (th 1800):"},null,null,null,1250,{"$f":"Talen!A68","v":"Liter / uur"}]
[{"$f":"Talen!A67","v":"Tijd nodig om volume te behandelen:"},null,null,null,{"$f":"E12/E15","v":0.04},{"$f":"Talen!A69","v":"Uren"},{"$f":"Talen!A74","v":"of"},{"$f":"E16/24","v":1.6666666666666668E-3},{"$f":"Talen!A70","v":"Dagen"}]
[{"$f":"Talen!A71","v":"Aantal liter hars nodig (theoretisch berekend):"},null,null,null,{"$f":"E14/72000*60","v":701.38888888888891},{"$f":"Talen!A73","v":"Liter"}]
[{"$f":"Talen!A72","v":"Aantal liter hars nodig (met 5% reserve,naar boven afgerond):"},null,null,null,{"$f":"CEILING(E17*1.05,1)","v":737},{"$f":"F17","v":"Liter"}]
[]
[]
[{"$f":"Talen!A47","v":"Benodigde Materialen:"}]
[null,null,{"$f":"Talen!A48","v":"Artikelnummer"},{"$f":"Talen!A49","v":"Omschrijving"},null,null,{"$f":"Talen!A50","v":"aantal"},{"$f":"Talen!A51","v":"prijs"}]
[]
[null,null,{"$f":"Data!A4","v":7738329421},{"$f":"Data!C4","v":"NFK2 vulinrichting"},null,null,1,{"$f":"G24*Data!E4","v":259}]
[null,null,{"$f":"IF(E14<16001,Data!A2,IF(E14<40001,Data!A2,IF(E14<1000000000,Data!A3)))","v":7738330146},{"$f":"VLOOKUP(C25,Data!$A$2:$E$42,2,)","v":"VES Kit P8000 Profi"},null,null,1,{"$f":"VLOOKUP(C25,Data!A2:E10,5,)","v":1040.29}]
[null,null,{"$f":"Data!A10","v":7739453974},{"$f":"VLOOKUP(C26,Data!$A$2:$E$42,2,)","v":"Hars"},null,null,{"$f":"E18","v":737},{"$f":"G26*Data!E10","v":7591.1}]
[null,null,{"$f":"IF(I27=(ROUNDUP(E18/60,0)-1),Data!A6,Data!A7)","v":7739453971},{"$f":"VLOOKUP(C27,Data!$A$2:$E$42,2,)","v":"Water dienst ASA+1 wissel"},null,null,1,{"$f":"VLOOKUP(C27,Data!A2:E10,5,)","v":953}]
[null,null,{"$f":"Data!A8","v":7739453972},{"$f":"VLOOKUP(C28,Data!$A$2:$E$42,2,)","v":"Water controle+harswissel"},null,null,{"$f":"IF((ROUNDUP(G26/60,0)-2)<0,0,ROUNDUP(G26/60,0)-2)","v":11},{"$f":"G28*(Data!E7)","v":10483}]
[null,null,{"$f":"Data!A9","v":7739453973},{"$f":"VLOOKUP(C29,Data!$A$2:$E$42,2,)","v":"Water waarborg bypassunit"},null,null,1,{"$f":"G29*(Data!E8)","v":183}]

{"sheet":"Talen","index":9,"n_rows":75,"n_cols":3,"rows_kept":75,"cut":false,"hidden":true,"merged":[]}
[1,"1: Nederlands | 2: Frans"]
["Keuze taal","NL","FR"]
[{"$f":"IF($A$1=1,B3,C3)","v":"Capaciteitsberekening voor VES patronen"},"Capaciteitsberekening voor VES patronen","Calcul de la capacité des cartouches VES"]
[{"$f":"IF($A$1=1,B4,C4)","v":"Start"},"Start","Démarrer"]
["Totaal vermogen installatie","Totaal vermogen installatie","Puissance totale de l'installation"]
["Waterinhoud gekend:","Waterinhoud gekend:","Volume d'eau connu :"]
["Stap 1: Totale vermogen installatie ","Stap 1: Totale vermogen installatie ","Étape 1 : Puissance totale de l'installation"]
["Ja","Ja","Oui"]
["Nee","Nee","Non"]
["Verder","Verder","Suivant"]
["Terug","Terug","Retour"]
["Liter","Liter","Litres"]
["Geef de totale waterinhoud","Geef de totale waterinhoud","Entrer le volume d'eau total"]
["Stap 2 : Ingave waterinhoud","Stap 2 : Ingave waterinhoud","Étape 2 : Saisie du volume d'eau"]
["Stap 2 : Berekening waterinhoud","Stap 2 : Berekening waterinhoud","Étape 2 : Calcul du volume d'eau"]
["Waterinhoud leidingen gekend","Waterinhoud leidingen gekend","Volume d'eau conduites connu"]
["Bepalen via de rekentool","Bepalen via de rekentool","Déterminer via l'outil de calcul"]
["20% toeslag nemen op installatie?","20% toeslag nemen op installatie?","Ajouter 20% de plus à l'installation ?"]
["2.1 : Waterinhoud installatie berekenen:","2.1 : Waterinhoud installatie berekenen:","2.1 : Calcul du volume d'eau de l'installation :"]
["Waterinhoud ketel","Waterinhoud ketel","Volume d'eau de la chaudière"]
["Inhoud buffervaten indien aanwezig","Inhoud buffervaten indien aanwezig","Volume des réservoirs tampons, si présent"]
["Vermogen kringen  vloerverwarming","Vermogen kringen  vloerverwarming","Puissance des circuits de chauffage au sol"]
["vermogen kringen paneelradiatoren","vermogen kringen paneelradiatoren","Puissance des circuits des radiateurs à panneaux"]
["Waterinhoud installatie zonder leidingen","Waterinhoud installatie zonder leidingen","Volume d'eau de l'installation, hors conduites"]
["Vermogen kringen sierradiatoren","Vermogen kringen sierradiatoren","Puissance des circuits de radiateurs décoratifs"]
["Vermogen kringen convectoren","Vermogen kringen convectoren","Puissance des circuits de convecteurs"]
["Foute invoer","Foute invoer","Donnée incorrecte"]
["Waterinhoud leidingen bepalen","Waterinhoud leidingen bepalen","Déterminer le volume d'eau des conduites"]
["Duim","Duim","Pouce(s)"]
["l/m","l/m","l/m"]
["meter m","meter m","Mètre m"]
["Inhoud L","Inhoud L","Volume L"]
["Rekentool waterinhoud leidingen","Rekentool waterinhoud leidingen","Outil de calcul du volume d'eau des conduites"]
["Waterinhoud leidingen","Waterinhoud leidingen","Volume d'eau des conduites"]
["Kies één van de drie bovenstaande methodes om leidinginhoud te bepalen","Kies één van de drie bovenstaande methodes om leidinginhoud te bepalen","Sélectionner une des trois méthodes ci-dessus pour déterminer le volume des conduites"]
["Nederlands","Nederlands","Nederlands"]
["Français","Français","Français"]
["2.2 : Waterinhoud leidingen berekenen:","2.2 : Waterinhoud leidingen berekenen:","2.2 : Calcul du volume d'eau des conduites"]
["Gelieve minstens 1 waarde in te geven","Gelieve minstens 1 waarde in te geven","Veuillez entrer au moins 1 valeur"]
["Stap 3 : kies uw berekingswijze","Stap 3 : kies uw berekingswijze","Étape 3 : Choisir votre méthode de calcul"]
["Berekenen via schatting op basis van postnummer","Berekenen via schatting op basis van postnummer","Calcul via une estimation basée sur le code postal"]
["Berekenen via gekende geleidbaarheid van het vulwater in µS/cm","Berekenen via gekende geleidbaarheid van het vulwater in µS/cm","Calcul via la conductivité connue de l'eau de remplissage en µS/cm"]
["Stap 4 : Berekening via geleidbaarheid van het vulwater in µS/cm","Stap 4 : Berekening via geleidbaarheid van het vulwater in µS/cm","Étape 4 : Calcul via la conductivité de l'eau de remplissage en µS/cm"]
["Geleidbaarheid in µS/cm:","Geleidbaarheid in µS/cm:","Conductivité en µS/cm :"]
["Installatie-inhoud in L","Installatie-inhoud in L","Volume de l'installation en L"]
["Benodigde capaciteit","Benodigde capaciteit","Capacité requise"]
["Benodigde Materialen:","Benodigde Materialen:","Matériaux requis :"]
["Artikelnummer","Artikelnummer","Numéro d'article"]
["Omschrijving","Omschrijving","Description"]
["aantal","aantal","Nombre"]
["prijs","prijs","Prix"]
["Opnieuw beginnen","Opnieuw beginnen","Recommencer"]
["Afsluiten","Afsluiten","Terminer"]
["Stap 4 : Berekening via postnummer installatie-adres","Stap 4 : Berekening via postnummer installatie-adres","Étape 4 : Calcul via le code postal de l'adresse d'installation"]
["Postnummer","Postnummer","Code postal"]
["Geleidbaarheid in µS/cm voor deze postnr:","Geleidbaarheid in µS/cm voor deze postnr:","Conductivité en µS/cm pour ce code postal :"]
["<= Vul hier uw postcode in","<= Vul hier uw postcode in","<= Entrer votre code postal ici"]
["Geen waterbehandeling noodzakelijk","Geen waterbehandeling noodzakelijk","Pas de traitement de l’eau nécessaire"]
["Waterbehandeling noodzakelijk","Waterbehandeling noodzakelijk","Traitement de l’eau nécessaire"]
["Selectie van materialen","Selectie van materialen","Sélection du matériel"]
["Selectie van materialen en diensten","Selectie van materialen en diensten","Sélection du matériel et service"]
["Stap 5 : Keuze van materiaal","Stap 5 : Keuze van materiaal","Étape 5 : sélection du matériel"]
["Stap 5 : Keuze van materiaal en diensten","Stap 5 : Keuze van materiaal en diensten","Étape 5 : sélection du matériel et service"]
["Functie momenteel nog niet beschikbaar","Functie momenteel nog niet beschikbaar","Fonction momentanément indisponible"]
["Installatie-inhoud in L","Installatie-inhoud in L","Contenu de l’installation en L"]
["Debiet pomp bypassunit (th 1800):","Debiet pomp bypassunit (th 1800):","Débit de la pompe de l’unité by-pass (th 1800) "]
["Tijd nodig om volume te behandelen:","Tijd nodig om volume te behandelen:","Temps nécessaire pour le traitement du volume :"]
["Liter / uur","Liter / uur","Litre/heure"]
[{"$f":"IF($A$1=1,B69,C69)","v":"Uren"},"Uren","Heures"]
["Dagen","Dagen","Jours"]
["Aantal liter hars nodig (theoretisch berekend):","Aantal liter hars nodig (theoretisch berekend):","Nombre de litres de résine nécessaires (calcul théorique) :"]
["Aantal liter hars nodig (met 5% reserve,naar boven afgerond):","Aantal liter hars nodig (met 5% reserve,naar boven afgerond):","Nombre de litres de résine nécessaires (avec 5 % de réserve, arrondi au chiffre supérieur) :"]
["Liter","Liter","Litre"]
["of","of","ou"]
["Benodigde materialen voor waterkwaliteit","Benodigde materialen voor waterkwaliteit","Matériel nécessaire pour la qualité de l’eau"]

{"sheet":"Leveringsgebieden","index":10,"n_rows":320,"n_cols":12,"rows_kept":320,"cut":false,"hidden":true,"merged":[]}
["Gemeente","Leveringsgebied(en)",null,null,null,"positie /","Lengte","LEV1","LEV2","COND1","COND2"]
["Oudergem","DW B7/ DW B16",1160,797,{"$f":"A2","v":"Oudergem"},{"$f":"SEARCH(\"/\",B2)","v":6},{"$f":"LEN(B2)","v":13},"DW B7","DW B16",797,706,{"$f":"IFERROR(IF(J2<K2,K2,J2),\"\")","v":797}]
["Herne","DW B1",1540,756,{"$f":"A3","v":"Herne"}]
["Bever","DW B1",1547,756,"Bever"]
["Hoeilaart","DW B17",1560,745,"Hoeilaart"]
["Galmaarden","DW B2",1570,772,"Galmaarden"]
["Sint-Pieters-Leeuw","IWVB-BFI41/IWVB-BFI43",1600,704.1,"Sint-Pieters-Leeuw",{"$f":"SEARCH(\"/\",B7)","v":11},{"$f":"LEN(B7)","v":21},"Vivaqua-BFI41","IWVB-BFI43",704.1,620.29999999999995]
["Drogenbos","IWVB-BFI43",1620,620.29999999999995,"Drogenbos"]
["Linkebeek","Vivaqua-R50",1630,527.5,"Linkebeek",{"$f":"SEARCH(\"/\",B9)","v":{"$error":"#VALUE!"}},{"$f":"LEN(B9)","v":11},{"$f":"LEFT(B9,F9-1)","v":{"$error":"#VALUE!"}},{"$f":"MID(B9,F9+1,G9-F9)","v":{"$error":"#VALUE!"}},{"$error":"#VALUE!"},{"$error":"#VALUE!"}]
["Sint-Genesius-Rode","IWVB-B80/IWVB-R50",1640,704.1,"Sint-Genesius-Rode",{"$f":"SEARCH(\"/\",B10)","v":9},{"$f":"LEN(B10)","v":17},"IWVB-B80","IWVB-R50",638.29999999999995,704.1,{"$f":"IFERROR(IF(J10<K10,K10,J10),\"\")","v":704.1}]
["Beersel","TMVW LG 6",1650,784,"Beersel"]
["Pepingen","DW B1/DW B2",1670,772,"Pepingen",{"$f":"SEARCH(\"/\",B12)","v":6},{"$f":"LEN(B12)","v":11},{"$f":"LEFT(B12,F12-1)","v":"DW B1"},{"$f":"MID(B12,F12+1,G12-F12)","v":"DW B2"},756,772]
["Dilbeek","IWVB-BFI43/IWVB-R50",1700,704.1,"Dilbeek",{"$f":"SEARCH(\"/\",B13)","v":11},{"$f":"LEN(B13)","v":19},"IWVB-BFI43","IWVB-R50",620.29999999999995,704.1,{"$f":"IFERROR(IF(J13<K13,K13,J13),\"\")","v":704.1}]
["Asse","TMVW LG 2",1730,785,"Asse"]
["Ternat","DW B2/TMVW LG 2",1740,785,"Ternat",{"$f":"SEARCH(\"/\",B15)","v":6},{"$f":"LEN(B15)","v":15},{"$f":"LEFT(B15,F15-1)","v":"DW B2"},{"$f":"MID(B15,F15+1,G15-F15)","v":"TMVW LG 2"},772,785]
["Opwijk","DW B3/TMVW LG 2",1745,785,"Opwijk",{"$f":"SEARCH(\"/\",B16)","v":6},{"$f":"LEN(B16)","v":15},{"$f":"LEFT(B16,F16-1)","v":"DW B3"},{"$f":"MID(B16,F16+1,G16-F16)","v":"TMVW LG 2"},716,785]
["Lennik","DW B2",1750,772,"Lennik"]
["Gooik","DW B2",1755,772,"Gooik"]
["Roosdaal","DW B2",1760,772,"Roosdaal"]
["Liedekerke","TMVW LG 2",1770,785,"Liedekerke"]
["Wemmel","IWVB-R50",1780,527.5,"Wemmel",{"$f":"SEARCH(\"/\",B21)","v":{"$error":"#VALUE!"}},{"$f":"LEN(B21)","v":8},{"$error":"#VALUE!"},{"$error":"#VALUE!"},{"$error":"#VALUE!"},{"$error":"#VALUE!"}]
["Merchtem","DW B3",1785,716,"Merchtem"]
["Affligem","TMVW LG 2",1790,785,"Affligem"]
["Vilvoorde","DW B3/DW B5",1800,716,"Vilvoorde",{"$f":"SEARCH(\"/\",B24)","v":6},{"$f":"LEN(B24)","v":11},{"$f":"LEFT(B24,F24-1)","v":"DW B3"},{"$f":"MID(B24,F24+1,G24-F24)","v":"DW B5"},716,705.66666666666663]
["Steenokkerzeel","DW B5/Vivaqua-R50",1820,705.66666666666663,"Steenokkerzeel",{"$f":"SEARCH(\"/\",B25)","v":6},{"$f":"LEN(B25)","v":17},{"$f":"LEFT(B25,F25-1)","v":"DW B5"},{"$f":"MID(B25,F25+1,G25-F25)","v":"Vivaqua-R50"},705.66666666666663,527.5]
["Londerzeel","DW B3",1840,716,"Londerzeel"]
["Grimbergen","DW B3/IWVB-BFI41",1850,716,"Grimbergen",{"$f":"SEARCH(\"/\",B27)","v":6},{"$f":"LEN(B27)","v":16},"DW B3","Vivaqua-BFI41",716,704.1]
["Meise","DW B3",1860,716,"Meise"]
["Kampenhout","DW B5",1910,705.66666666666663,"Kampenhout"]
["Zaventem","DW B5/IWVB-BFI41",1930,705.66666666666663,"Zaventem",{"$f":"SEARCH(\"/\",B30)","v":6},{"$f":"LEN(B30)","v":16},"DW B5","Vivaqua-BFI41",705.66666666666663,704.1]
["Kraainem","Vivaqua-BFI41",1950,704.1,"Kraainem",{"$f":"SEARCH(\"/\",B31)","v":{"$error":"#VALUE!"}},{"$f":"LEN(B31)","v":13},{"$f":"LEFT(B31,F31-1)","v":{"$error":"#VALUE!"}},{"$f":"MID(B31,F31+1,G31-F31)","v":{"$error":"#VALUE!"}},{"$error":"#VALUE!"},{"$error":"#VALUE!"}]
["Zemst","DW B3/DW B5/DW B15",1980,716,"Zemst",{"$f":"SEARCH(\"/\",B32)","v":6},{"$f":"LEN(B32)","v":18},"DW B3","DW B15",716,446.85]
["Berendrecht","AWW-PB",2040,573,"Berendrecht"]
["Zandvliet","AWW-PB",2040,573,"Zandvliet"]
["Antwerpen","AWW-PST",2060,747,"Antwerpen"]
["Zwijndrecht","AWW-PST",2070,747,"Zwijndrecht"]
["Wijnegem","Pidpa 10",2110,587.39,"Wijnegem"]
["Borsbeek","Pidpa 10",2150,587.39,"Borsbeek"]
["Wommelgem","Pidpa 10",2160,587.39,"Wommelgem"]
["Herentals","Pidpa 4",2200,401.8,"Herentals"]
["Heist-op-den-Berg","Pidpa 11",2220,458.56,"Heist-op-den-Berg"]
["Herselt","Pidpa 11",2230,458.56,"Herselt"]
["Hulshout","Pidpa 11",2235,458.56,"Hulshout"]
["Zandhoven ","Pidpa 4/Pidpa 13",2240,451.35,"Zandhoven ",{"$f":"SEARCH(\"/\",B44)","v":8},{"$f":"LEN(B44)","v":16},{"$f":"LEFT(B44,F44-1)","v":"Pidpa 4"},{"$f":"MID(B44,F44+1,G44-F44)","v":"Pidpa 13"},401.8,451.35]
["Olen","Pidpa 4",2250,401.8,"Olen"]
["Westerlo","Pidpa 11",2260,458.56,"Westerlo"]
["Herenthout","Pidpa 4",2270,401.8,"Herenthout"]
["Lille","Pidpa 4/Pidpa 5/Pidpa 8",2275,446.85,"Lille",{"$f":"SEARCH(\"/\",B48)","v":8},{"$f":"LEN(B48)","v":23},"Pidpa 4","Pidpa 8",401.8,446.85,{"$f":"IFERROR(IF(J48<K48,K48,J48),\"\")","v":446.85}]
["Grobbendonk","Pidpa 4/Pidpa 13",2280,451.35,"Grobbendonk",{"$f":"SEARCH(\"/\",B49)","v":8},{"$f":"LEN(B49)","v":16},{"$f":"LEFT(B49,F49-1)","v":"Pidpa 4"},{"$f":"MID(B49,F49+1,G49-F49)","v":"Pidpa 13"},401.8,451.35]
["Vorselaar","Pidpa 4",2290,401.8,"Vorselaar"]
["Turnhout","Pidpa 9",2300,338.74,"Turnhout"]
["Rijkevorsel","Pidpa 5",2310,403.6,"Rijkevorsel"]
["Hoogstraten","Pidpa 5",2320,403.6,"Hoogstraten"]
["Merksplas","Pidpa 8",2330,446.85,"Merksplas"]
["Beerse","Pidpa 5/Pidpa 8",2340,446.85,"Beerse",{"$f":"SEARCH(\"/\",B55)","v":8},{"$f":"LEN(B55)","v":15},{"$f":"LEFT(B55,F55-1)","v":"Pidpa 5"},{"$f":"MID(B55,F55+1,G55-F55)","v":"Pidpa 8"},403.6,446.85]
["Vosselaar","Pidpa 8",2350,446.85,"Vosselaar"]
["Arendonk","Pidpa 9",2370,338.74,"Arendonk"]
["Ravels","Pidpa 9",2380,338.74,"Ravels"]
["Baarle-Hertog","Pidpa 8",2387,446.85,"Baarle-Hertog"]
["Malle","Pidpa 5",2390,403.6,"Malle"]
["Mol","Pidpa 7/Pidpa 9",2400,338.74,"Mol",{"$f":"SEARCH(\"/\",B61)","v":8},{"$f":"LEN(B61)","v":15},{"$f":"LEFT(B61,F61-1)","v":"Pidpa 7"},{"$f":"MID(B61,F61+1,G61-F61)","v":"Pidpa 9"},312.61,338.74]
["Laakdal","Pidpa 11",2430,458.56,"Laakdal"]
["Geel","Pidpa 1/Pidpa 4/Pidpa 7/Pidpa 9/Pidpa 11",2440,458.56,"Geel",{"$f":"SEARCH(\"/\",B63)","v":8},{"$f":"LEN(B63)","v":40},"Pidpa 1","Pidpa 4/Pidpa 7/Pidpa 9/Pidpa 11",359.46,458.56,{"$f":"IFERROR(IF(J63<K63,K63,J63),\"\")","v":458.56}]
["Meerhout","Pidpa 1",2450,359.46,"Meerhout"]
["Kasterlee","Pidpa 4/Pidpa 9",2460,401.8,"Kasterlee",{"$f":"SEARCH(\"/\",B65)","v":8},{"$f":"LEN(B65)","v":15},{"$f":"LEFT(B65,F65-1)","v":"Pidpa 4"},{"$f":"MID(B65,F65+1,G65-F65)","v":"Pidpa 9"},401.8,338.74]
["Retie","Pidpa 9",2470,338.74,"Retie"]
["Dessel","Pidpa 9",2480,338.74,{"$f":"A67","v":"Dessel"}]
["Balen","Pidpa 1/Pidpa 7",2490,359.46,"Balen",{"$f":"SEARCH(\"/\",B68)","v":8},{"$f":"LEN(B68)","v":15},{"$f":"LEFT(B68,F68-1)","v":"Pidpa 1"},{"$f":"MID(B68,F68+1,G68-F68)","v":"Pidpa 7"},359.46,312.61]
["Lier","Pidpa 13",2500,451.35,"Lier"]
["Ranst","Pidpa 10/Pidpa 13",2520,587.39,"Ranst",{"$f":"SEARCH(\"/\",B70)","v":9},{"$f":"LEN(B70)","v":17},{"$f":"LEFT(B70,F70-1)","v":"Pidpa 10"},{"$f":"MID(B70,F70+1,G70-F70)","v":"Pidpa 13"},587.39,451.35]
["Boechout","AWW-PST/Pidpa 13",2530,747,"Boechout",{"$f":"SEARCH(\"/\",B71)","v":8},{"$f":"LEN(B71)","v":16},{"$f":"LEFT(B71,F71-1)","v":"AWW-PST"},{"$f":"MID(B71,F71+1,G71-F71)","v":"Pidpa 13"},747,451.35]
["Hove","AWW-PST",2540,747,"Hove"]
["Lint","Pidpa 13",2547,451.35,"Lint"]
["Kontich","AWW-PST/Pidpa 12",2550,747,"Kontich",{"$f":"SEARCH(\"/\",B74)","v":8},{"$f":"LEN(B74)","v":16},{"$f":"LEFT(B74,F74-1)","v":"AWW-PST"},{"$f":"MID(B74,F74+1,G74-F74)","v":"Pidpa 12"},747,480.18]
["Nijlen","Pidpa 13",2560,451.35,"Nijlen"]
["Duffel","Pidpa 12/Pidpa 13",2570,480.18,"Duffel",{"$f":"SEARCH(\"/\",B76)","v":9},{"$f":"LEN(B76)","v":17},{"$f":"LEFT(B76,F76-1)","v":"Pidpa 12"},{"$f":"MID(B76,F76+1,G76-F76)","v":"Pidpa 13"},480.18,451.35]
["Putte","Pidpa 11",2580,458.56,"Putte"]
["Berlaar","Pidpa 13",2590,451.35,"Berlaar"]
["Hemiksem","Pidpa 12",2620,480.18,"Hemiksem"]
["Schelle","Pidpa 12",2627,480.18,"Schelle"]
{"$rows_left_out":241}
{"sheet":"Data","index":11,"n_rows":11,"n_cols":5,"rows_kept":11,"cut":false,"hidden":true,"merged":[]}
["artnr","VES Patrone","nl","fr","prijs"]
[7738330145,{"$f":"IF(Talen!$A$1=1,C2,D2)","v":"VES Kit P4000 Profi"},"VES Kit P4000 Profi","VES Kit P4000 Profi",802.67]
[7738330146,{"$f":"IF(Talen!$A$1=1,C3,D3)","v":"VES Kit P8000 Profi"},"VES Kit P8000 Profi","VES Kit P8000 Profi",1040.29]
[7738329421,{"$f":"IF(Talen!$A$1=1,C4,D4)","v":"NFK2 vulinrichting"},"NFK2 vulinrichting","Dispositif de remplissage NFK2",259]
[7738330149,{"$f":"IF(Talen!$A$1=1,C5,D5)","v":"Navulverpakking NF8000"},"Navulverpakking NF8000","Pack de recharge Logafix NF8000",144.25]
[7739453970,{"$f":"IF(Talen!$A$1=1,C6,D6)","v":"Water basisdienst ASA"},"Water basisdienst ASA","Eau service de base ASA",797]
[7739453971,{"$f":"IF(Talen!$A$1=1,C7,D7)","v":"Water dienst ASA+1 wissel"},"Water dienst ASA+1 wissel","Eau service ASA+1 chang",953]
[7739453972,{"$f":"IF(Talen!$A$1=1,C8,D8)","v":"Water controle+harswissel"},"Water controle+harswissel","Eau controle+chang resine",183]
[7739453973,{"$f":"IF(Talen!$A$1=1,C9,D9)","v":"Water waarborg bypassunit"},"Water waarborg bypassunit","Eau caution unite bypass",500]
[7739453974,{"$f":"IF(Talen!$A$1=1,C10,D10)","v":"Hars"},"Hars","Resine",10.3]
[7738330148,{"$f":"IF(Talen!$A$1=1,C11,D11)","v":"Navulverpakking NF2000"},"Navulverpakking NF2000","Pack de recharge Logafix NF2000",53.61]